{"text_format":"1","workbook":"xlsx","n_sheets":20,"sheets":["Hauptmenü","PSM","Düngung","Saatgut","Kosten","Arbeitskräfte","Berechnungen","Maschinen","Auswertung","Betriebsdaten","sonstiges","Schlag","Durchschnittspreise","letztes Blatt","Sprünge","Allgemeines","Düngerliste","PSMListe","Bemerkungen PSM","Bemerkungen Dünger"],"not_rendered":{"charts":1,"images":3,"macros":1,"external_links":1,"defined_names":29,"comments":16,"pivot_tables":0},"unopened":[{"sheet":"Sprünge","index":14,"reason":"part_missing"},{"sheet":"Allgemeines","index":15,"reason":"part_missing"}],"bounds":{"document_bytes":16777216,"sheet_cells":100000,"rows_first":2000,"rows_last":500,"rows_between":2000,"halvings":0,"cell_chars":16384,"cell_head_chars":4096},"cells_cut":0,"cells_raw":0,"read":"whole","date_system":"1900"}

{"sheet":"Hauptmenü","index":0,"n_rows":22,"n_cols":18,"rows_kept":22,"cut":false,"hidden":false,"merged":[[3,4,3,17],[17,9,17,12],[4,17,4,18],[12,8,12,9],[13,8,13,9],[17,13,17,14]]}
[]
[]
[]
[]
[null,null,null,null,"Beschreibung",null,null,null,null,null,null,null,null,null,null,null,null,{"$f":"TODAY()","v":"2019-11-05"}]
[null,null,null,null,"Kontakt"]
[]
[]
[]
[]
[]
[]
[]
[]
[]
[]
[]
[null,null,null,"Dieses Programm ist für den Betrieb:",null,null,null,null,null,"Große Dankbar",null,null,null,"lizensiert !!",null,null,null,"ã Große Dankbar"]
[]
[]
[]
["Programmerstellung: Ralf Große Dankbar,Version 03-2019"]

{"sheet":"PSM","index":1,"n_rows":158,"n_cols":63,"rows_kept":158,"cut":false,"hidden":false,"merged":[[1,5,1,6]]}
[]
[null,null,null,null,null,"Pflanzenschutz"]
[null,"Schlag",{"$f":"Betriebsdaten!C11","v":"Bester Feld"},{"$f":"Betriebsdaten!D11","v":0},{"$f":"Betriebsdaten!E11","v":0},{"$f":"Betriebsdaten!F11","v":0},{"$f":"Betriebsdaten!G11","v":0},{"$f":"Betriebsdaten!H11","v":0},{"$f":"Betriebsdaten!I11","v":0},{"$f":"Betriebsdaten!J11","v":0},{"$f":"Betriebsdaten!K11","v":0},{"$f":"Betriebsdaten!L11","v":0},{"$f":"Betriebsdaten!M11","v":0},{"$f":"Betriebsdaten!N11","v":0},{"$f":"Betriebsdaten!O11","v":0},{"$f":"Betriebsdaten!P11","v":0},{"$f":"Betriebsdaten!Q11","v":0},{"$f":"Betriebsdaten!R11","v":0},{"$f":"Betriebsdaten!S11","v":0},{"$f":"Betriebsdaten!T11","v":0},{"$f":"Betriebsdaten!U11","v":0},{"$f":"Betriebsdaten!V11","v":0},{"$f":"Betriebsdaten!W11","v":0},{"$f":"Betriebsdaten!X11","v":0},{"$f":"Betriebsdaten!Y11","v":0},{"$f":"Betriebsdaten!Z11","v":0},{"$f":"Betriebsdaten!AA11","v":25},{"$f":"Betriebsdaten!AB11","v":26},{"$f":"Betriebsdaten!AC11","v":27},{"$f":"Betriebsdaten!AD11","v":28},{"$f":"Betriebsdaten!AE11","v":29},{"$f":"Betriebsdaten!AF11","v":30},{"$f":"Betriebsdaten!AG11","v":31},{"$f":"Betriebsdaten!AH11","v":32},{"$f":"Betriebsdaten!AI11","v":33},{"$f":"Betriebsdaten!AJ11","v":34},{"$f":"Betriebsdaten!AK11","v":35},{"$f":"Betriebsdaten!AL11","v":36},{"$f":"Betriebsdaten!AM11","v":37},{"$f":"Betriebsdaten!AN11","v":38},{"$f":"Betriebsdaten!AO11","v":39},{"$f":"Betriebsdaten!AP11","v":40},{"$f":"Betriebsdaten!AQ11","v":41},{"$f":"Betriebsdaten!AR11","v":42},{"$f":"Betriebsdaten!AS11","v":43},{"$f":"Betriebsdaten!AT11","v":44},{"$f":"Betriebsdaten!AU11","v":45},{"$f":"Betriebsdaten!AV11","v":46},{"$f":"Betriebsdaten!AW11","v":47},{"$f":"Betriebsdaten!AX11","v":48},{"$f":"Betriebsdaten!AY11","v":49},{"$f":"Betriebsdaten!AZ11","v":50},{"$f":"Betriebsdaten!BA11","v":51},{"$f":"Betriebsdaten!BB11","v":52},{"$f":"Betriebsdaten!BC11","v":53},{"$f":"Betriebsdaten!BD11","v":54},{"$f":"Betriebsdaten!BE11","v":55},{"$f":"Betriebsdaten!BF11","v":56},{"$f":"Betriebsdaten!BG11","v":57},{"$f":"Betriebsdaten!BH11","v":58},{"$f":"Betriebsdaten!BI11","v":59},{"$f":"Betriebsdaten!BJ11","v":60}]
[null,"Frucht",{"$f":"Betriebsdaten!C15","v":"Spargel"},{"$f":"Betriebsdaten!D15","v":0},{"$f":"Betriebsdaten!E15","v":0},{"$f":"Betriebsdaten!F15","v":0},{"$f":"Betriebsdaten!G15","v":0},{"$f":"Betriebsdaten!H15","v":0},{"$f":"Betriebsdaten!I15","v":0},{"$f":"Betriebsdaten!J15","v":0},{"$f":"Betriebsdaten!K15","v":0},{"$f":"Betriebsdaten!L15","v":0},{"$f":"Betriebsdaten!M15","v":0},{"$f":"Betriebsdaten!N15","v":0},{"$f":"Betriebsdaten!O15","v":0},{"$f":"Betriebsdaten!P15","v":0},{"$f":"Betriebsdaten!Q15","v":0},{"$f":"Betriebsdaten!R15","v":0},{"$f":"Betriebsdaten!S15","v":0},{"$f":"Betriebsdaten!T15","v":0},{"$f":"Betriebsdaten!U15","v":0},{"$f":"Betriebsdaten!V15","v":0},{"$f":"Betriebsdaten!W15","v":0},{"$f":"Betriebsdaten!X15","v":0},{"$f":"Betriebsdaten!Y15","v":0},{"$f":"Betriebsdaten!Z15","v":0},{"$f":"Betriebsdaten!AA15","v":0},{"$f":"Betriebsdaten!AB15","v":0},{"$f":"Betriebsdaten!AC15","v":0},{"$f":"Betriebsdaten!AD15","v":0},{"$f":"Betriebsdaten!AE15","v":0},{"$f":"Betriebsdaten!AF15","v":0},{"$f":"Betriebsdaten!AG15","v":0},{"$f":"Betriebsdaten!AH15","v":0},{"$f":"Betriebsdaten!AI15","v":0},{"$f":"Betriebsdaten!AJ15","v":0},{"$f":"Betriebsdaten!AK15","v":0},{"$f":"Betriebsdaten!AL15","v":0},{"$f":"Betriebsdaten!AM15","v":0},{"$f":"Betriebsdaten!AN15","v":0},{"$f":"Betriebsdaten!AO15","v":0},{"$f":"Betriebsdaten!AP15","v":0},{"$f":"Betriebsdaten!AQ15","v":0},{"$f":"Betriebsdaten!AR15","v":0},{"$f":"Betriebsdaten!AS15","v":0},{"$f":"Betriebsdaten!AT15","v":0},{"$f":"Betriebsdaten!AU15","v":0},{"$f":"Betriebsdaten!AV15","v":0},{"$f":"Betriebsdaten!AW15","v":0},{"$f":"Betriebsdaten!AX15","v":0},{"$f":"Betriebsdaten!AY15","v":0},{"$f":"Betriebsdaten!AZ15","v":0},{"$f":"Betriebsdaten!BA15","v":0},{"$f":"Betriebsdaten!BB15","v":0},{"$f":"Betriebsdaten!BC15","v":0},{"$f":"Betriebsdaten!BD15","v":0},{"$f":"Betriebsdaten!BE15","v":0},{"$f":"Betriebsdaten!BF15","v":0},{"$f":"Betriebsdaten!BG15","v":0},{"$f":"Betriebsdaten!BH15","v":0},{"$f":"Betriebsdaten!BI15","v":0},{"$f":"Betriebsdaten!BJ15","v":0}]
[null,"Sorte",{"$f":"Betriebsdaten!C16","v":"Gijnlim"},{"$f":"Betriebsdaten!D16","v":0},{"$f":"Betriebsdaten!E16","v":0},{"$f":"Betriebsdaten!F16","v":0},{"$f":"Betriebsdaten!G16","v":0},{"$f":"Betriebsdaten!H16","v":0},{"$f":"Betriebsdaten!I16","v":0},{"$f":"Betriebsdaten!J16","v":0},{"$f":"Betriebsdaten!K16","v":0},{"$f":"Betriebsdaten!L16","v":0},{"$f":"Betriebsdaten!M16","v":0},{"$f":"Betriebsdaten!N16","v":0},{"$f":"Betriebsdaten!O16","v":0},{"$f":"Betriebsdaten!P16","v":0},{"$f":"Betriebsdaten!Q16","v":0},{"$f":"Betriebsdaten!R16","v":0},{"$f":"Betriebsdaten!S16","v":0},{"$f":"Betriebsdaten!T16","v":0},{"$f":"Betriebsdaten!U16","v":0},{"$f":"Betriebsdaten!V16","v":0},{"$f":"Betriebsdaten!W16","v":0},{"$f":"Betriebsdaten!X16","v":0},{"$f":"Betriebsdaten!Y16","v":0},{"$f":"Betriebsdaten!Z16","v":0},{"$f":"Betriebsdaten!AA16","v":0},{"$f":"Betriebsdaten!AB16","v":0},{"$f":"Betriebsdaten!AC16","v":0},{"$f":"Betriebsdaten!AD16","v":0},{"$f":"Betriebsdaten!AE16","v":0},{"$f":"Betriebsdaten!AF16","v":0},{"$f":"Betriebsdaten!AG16","v":0},{"$f":"Betriebsdaten!AH16","v":0},{"$f":"Betriebsdaten!AI16","v":0},{"$f":"Betriebsdaten!AJ16","v":0},{"$f":"Betriebsdaten!AK16","v":0},{"$f":"Betriebsdaten!AL16","v":0},{"$f":"Betriebsdaten!AM16","v":0},{"$f":"Betriebsdaten!AN16","v":0},{"$f":"Betriebsdaten!AO16","v":0},{"$f":"Betriebsdaten!AP16","v":0},{"$f":"Betriebsdaten!AQ16","v":0},{"$f":"Betriebsdaten!AR16","v":0},{"$f":"Betriebsdaten!AS16","v":0},{"$f":"Betriebsdaten!AT16","v":0},{"$f":"Betriebsdaten!AU16","v":0},{"$f":"Betriebsdaten!AV16","v":0},{"$f":"Betriebsdaten!AW16","v":0},{"$f":"Betriebsdaten!AX16","v":0},{"$f":"Betriebsdaten!AY16","v":0},{"$f":"Betriebsdaten!AZ16","v":0},{"$f":"Betriebsdaten!BA16","v":0},{"$f":"Betriebsdaten!BB16","v":0},{"$f":"Betriebsdaten!BC16","v":0},{"$f":"Betriebsdaten!BD16","v":0},{"$f":"Betriebsdaten!BE16","v":0},{"$f":"Betriebsdaten!BF16","v":0},{"$f":"Betriebsdaten!BG16","v":0},{"$f":"Betriebsdaten!BH16","v":0},{"$f":"Betriebsdaten!BI16","v":0},{"$f":"Betriebsdaten!BJ16","v":0}]
[null,"ha",{"$f":"Betriebsdaten!C17","v":3.8},{"$f":"Betriebsdaten!D17","v":0},{"$f":"Betriebsdaten!E17","v":0},{"$f":"Betriebsdaten!F17","v":0},{"$f":"Betriebsdaten!G17","v":0},{"$f":"Betriebsdaten!H17","v":0},{"$f":"Betriebsdaten!I17","v":0},{"$f":"Betriebsdaten!J17","v":0},{"$f":"Betriebsdaten!K17","v":0},{"$f":"Betriebsdaten!L17","v":0},{"$f":"Betriebsdaten!M17","v":0},{"$f":"Betriebsdaten!N17","v":0},{"$f":"Betriebsdaten!O17","v":0},{"$f":"Betriebsdaten!P17","v":0},{"$f":"Betriebsdaten!Q17","v":0},{"$f":"Betriebsdaten!R17","v":0},{"$f":"Betriebsdaten!S17","v":0},{"$f":"Betriebsdaten!T17","v":0},{"$f":"Betriebsdaten!U17","v":0},{"$f":"Betriebsdaten!V17","v":0},{"$f":"Betriebsdaten!W17","v":0},{"$f":"Betriebsdaten!X17","v":0},{"$f":"Betriebsdaten!Y17","v":0},{"$f":"Betriebsdaten!Z17","v":0},{"$f":"Betriebsdaten!AA17","v":0},{"$f":"Betriebsdaten!AB17","v":0},{"$f":"Betriebsdaten!AC17","v":0},{"$f":"Betriebsdaten!AD17","v":0},{"$f":"Betriebsdaten!AE17","v":0},{"$f":"Betriebsdaten!AF17","v":0},{"$f":"Betriebsdaten!AG17","v":0},{"$f":"Betriebsdaten!AH17","v":0},{"$f":"Betriebsdaten!AI17","v":0},{"$f":"Betriebsdaten!AJ17","v":0},{"$f":"Betriebsdaten!AK17","v":0},{"$f":"Betriebsdaten!AL17","v":0},{"$f":"Betriebsdaten!AM17","v":0},{"$f":"Betriebsdaten!AN17","v":0},{"$f":"Betriebsdaten!AO17","v":0},{"$f":"Betriebsdaten!AP17","v":0},{"$f":"Betriebsdaten!AQ17","v":0},{"$f":"Betriebsdaten!AR17","v":0},{"$f":"Betriebsdaten!AS17","v":0},{"$f":"Betriebsdaten!AT17","v":0},{"$f":"Betriebsdaten!AU17","v":0},{"$f":"Betriebsdaten!AV17","v":0},{"$f":"Betriebsdaten!AW17","v":0},{"$f":"Betriebsdaten!AX17","v":0},{"$f":"Betriebsdaten!AY17","v":0},{"$f":"Betriebsdaten!AZ17","v":0},{"$f":"Betriebsdaten!BA17","v":0},{"$f":"Betriebsdaten!BB17","v":0},{"$f":"Betriebsdaten!BC17","v":0},{"$f":"Betriebsdaten!BD17","v":0},{"$f":"Betriebsdaten!BE17","v":0},{"$f":"Betriebsdaten!BF17","v":0},{"$f":"Betriebsdaten!BG17","v":0},{"$f":"Betriebsdaten!BH17","v":0},{"$f":"Betriebsdaten!BI17","v":0},{"$f":"Betriebsdaten!BJ17","v":0}]
[null,"Datum","2018-05-27"]
[null,"Mittel 1","Stomp Aqua 3,5 + Sencor liquid 0,4"]
[null,"Preis",{"$f":"IF(C8=\"\",0,VLOOKUP(C8,PSMListe!Pflanzenschutz,2,FALSE))","v":56.22},{"$f":"IF(D8=\"\",0,VLOOKUP(D8,PSMListe!Pflanzenschutz,2,FALSE))","v":0},{"$f":"IF(E8=\"\",0,VLOOKUP(E8,PSMListe!Pflanzenschutz,2,FALSE))","v":0},{"$f":"IF(F8=\"\",0,VLOOKUP(F8,PSMListe!Pflanzenschutz,2,FALSE))","v":0},{"$f":"IF(G8=\"\",0,VLOOKUP(G8,PSMListe!Pflanzenschutz,2,FALSE))","v":0},{"$f":"IF(H8=\"\",0,VLOOKUP(H8,PSMListe!Pflanzenschutz,2,FALSE))","v":0},{"$f":"IF(I8=\"\",0,VLOOKUP(I8,PSMListe!Pflanzenschutz,2,FALSE))","v":0},{"$f":"IF(J8=\"\",0,VLOOKUP(J8,PSMListe!Pflanzenschutz,2,FALSE))","v":0},{"$f":"IF(K8=\"\",0,VLOOKUP(K8,PSMListe!Pflanzenschutz,2,FALSE))","v":0},{"$f":"IF(L8=\"\",0,VLOOKUP(L8,PSMListe!Pflanzenschutz,2,FALSE))","v":0},{"$f":"IF(M8=\"\",0,VLOOKUP(M8,PSMListe!Pflanzenschutz,2,FALSE))","v":0},{"$f":"IF(N8=\"\",0,VLOOKUP(N8,PSMListe!Pflanzenschutz,2,FALSE))","v":0},{"$f":"IF(O8=\"\",0,VLOOKUP(O8,PSMListe!Pflanzenschutz,2,FALSE))","v":0},{"$f":"IF(P8=\"\",0,VLOOKUP(P8,PSMListe!Pflanzenschutz,2,FALSE))","v":0},{"$f":"IF(Q8=\"\",0,VLOOKUP(Q8,PSMListe!Pflanzenschutz,2,FALSE))","v":0},{"$f":"IF(R8=\"\",0,VLOOKUP(R8,PSMListe!Pflanzenschutz,2,FALSE))","v":0},{"$f":"IF(S8=\"\",0,VLOOKUP(S8,PSMListe!Pflanzenschutz,2,FALSE))","v":0},{"$f":"IF(T8=\"\",0,VLOOKUP(T8,PSMListe!Pflanzenschutz,2,FALSE))","v":0},{"$f":"IF(U8=\"\",0,VLOOKUP(U8,PSMListe!Pflanzenschutz,2,FALSE))","v":0},{"$f":"IF(V8=\"\",0,VLOOKUP(V8,PSMListe!Pflanzenschutz,2,FALSE))","v":0},{"$f":"IF(W8=\"\",0,VLOOKUP(W8,PSMListe!Pflanzenschutz,2,FALSE))","v":0},{"$f":"IF(X8=\"\",0,VLOOKUP(X8,PSMListe!Pflanzenschutz,2,FALSE))","v":0},{"$f":"IF(Y8=\"\",0,VLOOKUP(Y8,PSMListe!Pflanzenschutz,2,FALSE))","v":0},{"$f":"IF(Z8=\"\",0,VLOOKUP(Z8,PSMListe!Pflanzenschutz,2,FALSE))","v":0},{"$f":"IF(AA8=\"\",0,VLOOKUP(AA8,PSMListe!Pflanzenschutz,2,FALSE))","v":0},{"$f":"IF(AB8=\"\",0,VLOOKUP(AB8,PSMListe!Pflanzenschutz,2,FALSE))","v":0},{"$f":"IF(AC8=\"\",0,VLOOKUP(AC8,PSMListe!Pflanzenschutz,2,FALSE))","v":0},{"$f":"IF(AD8=\"\",0,VLOOKUP(AD8,PSMListe!Pflanzenschutz,2,FALSE))","v":0},{"$f":"IF(AE8=\"\",0,VLOOKUP(AE8,PSMListe!Pflanzenschutz,2,FALSE))","v":0},{"$f":"IF(AF8=\"\",0,VLOOKUP(AF8,PSMListe!Pflanzenschutz,2,FALSE))","v":0},{"$f":"IF(AG8=\"\",0,VLOOKUP(AG8,PSMListe!Pflanzenschutz,2,FALSE))","v":0},{"$f":"IF(AH8=\"\",0,VLOOKUP(AH8,PSMListe!Pflanzenschutz,2,FALSE))","v":0},{"$f":"IF(AI8=\"\",0,VLOOKUP(AI8,PSMListe!Pflanzenschutz,2,FALSE))","v":0},{"$f":"IF(AJ8=\"\",0,VLOOKUP(AJ8,PSMListe!Pflanzenschutz,2,FALSE))","v":0},{"$f":"IF(AK8=\"\",0,VLOOKUP(AK8,PSMListe!Pflanzenschutz,2,FALSE))","v":0},{"$f":"IF(AL8=\"\",0,VLOOKUP(AL8,PSMListe!Pflanzenschutz,2,FALSE))","v":0},{"$f":"IF(AM8=\"\",0,VLOOKUP(AM8,PSMListe!Pflanzenschutz,2,FALSE))","v":0},{"$f":"IF(AN8=\"\",0,VLOOKUP(AN8,PSMListe!Pflanzenschutz,2,FALSE))","v":0},{"$f":"IF(AO8=\"\",0,VLOOKUP(AO8,PSMListe!Pflanzenschutz,2,FALSE))","v":0},{"$f":"IF(AP8=\"\",0,VLOOKUP(AP8,PSMListe!Pflanzenschutz,2,FALSE))","v":0},{"$f":"IF(AQ8=\"\",0,VLOOKUP(AQ8,PSMListe!Pflanzenschutz,2,FALSE))","v":0},{"$f":"IF(AR8=\"\",0,VLOOKUP(AR8,PSMListe!Pflanzenschutz,2,FALSE))","v":0},{"$f":"IF(AS8=\"\",0,VLOOKUP(AS8,PSMListe!Pflanzenschutz,2,FALSE))","v":0},{"$f":"IF(AT8=\"\",0,VLOOKUP(AT8,PSMListe!Pflanzenschutz,2,FALSE))","v":0},{"$f":"IF(AU8=\"\",0,VLOOKUP(AU8,PSMListe!Pflanzenschutz,2,FALSE))","v":0},{"$f":"IF(AV8=\"\",0,VLOOKUP(AV8,PSMListe!Pflanzenschutz,2,FALSE))","v":0},{"$f":"IF(AW8=\"\",0,VLOOKUP(AW8,PSMListe!Pflanzenschutz,2,FALSE))","v":0},{"$f":"IF(AX8=\"\",0,VLOOKUP(AX8,PSMListe!Pflanzenschutz,2,FALSE))","v":0},{"$f":"IF(AY8=\"\",0,VLOOKUP(AY8,PSMListe!Pflanzenschutz,2,FALSE))","v":0},{"$f":"IF(AZ8=\"\",0,VLOOKUP(AZ8,PSMListe!Pflanzenschutz,2,FALSE))","v":0},{"$f":"IF(BA8=\"\",0,VLOOKUP(BA8,PSMListe!Pflanzenschutz,2,FALSE))","v":0},{"$f":"IF(BB8=\"\",0,VLOOKUP(BB8,PSMListe!Pflanzenschutz,2,FALSE))","v":0},{"$f":"IF(BC8=\"\",0,VLOOKUP(BC8,PSMListe!Pflanzenschutz,2,FALSE))","v":0},{"$f":"IF(BD8=\"\",0,VLOOKUP(BD8,PSMListe!Pflanzenschutz,2,FALSE))","v":0},{"$f":"IF(BE8=\"\",0,VLOOKUP(BE8,PSMListe!Pflanzenschutz,2,FALSE))","v":0},{"$f":"IF(BF8=\"\",0,VLOOKUP(BF8,PSMListe!Pflanzenschutz,2,FALSE))","v":0},{"$f":"IF(BG8=\"\",0,VLOOKUP(BG8,PSMListe!Pflanzenschutz,2,FALSE))","v":0},{"$f":"IF(BH8=\"\",0,VLOOKUP(BH8,PSMListe!Pflanzenschutz,2,FALSE))","v":0},{"$f":"IF(BI8=\"\",0,VLOOKUP(BI8,PSMListe!Pflanzenschutz,2,FALSE))","v":0},{"$f":"IF(BJ8=\"\",0,VLOOKUP(BJ8,PSMListe!Pflanzenschutz,2,FALSE))","v":0}]
[null,"Menge",1]
[null,"Bemerkung","Ralf,  Unkraut        "]
[null,"Datum","2018-07-21"]
[null,"Mittel 2","Amistar Opti"]
[null,"Preis",{"$f":"IF(C13=\"\",0,VLOOKUP(C13,PSMListe!Pflanzenschutz,2,FALSE))","v":18.600000000000001},{"$f":"IF(D13=\"\",0,VLOOKUP(D13,PSMListe!Pflanzenschutz,2,FALSE))","v":0},{"$f":"IF(E13=\"\",0,VLOOKUP(E13,PSMListe!Pflanzenschutz,2,FALSE))","v":0},{"$f":"IF(F13=\"\",0,VLOOKUP(F13,PSMListe!Pflanzenschutz,2,FALSE))","v":0},{"$f":"IF(G13=\"\",0,VLOOKUP(G13,PSMListe!Pflanzenschutz,2,FALSE))","v":0},{"$f":"IF(H13=\"\",0,VLOOKUP(H13,PSMListe!Pflanzenschutz,2,FALSE))","v":0},{"$f":"IF(I13=\"\",0,VLOOKUP(I13,PSMListe!Pflanzenschutz,2,FALSE))","v":0},{"$f":"IF(J13=\"\",0,VLOOKUP(J13,PSMListe!Pflanzenschutz,2,FALSE))","v":0},{"$f":"IF(K13=\"\",0,VLOOKUP(K13,PSMListe!Pflanzenschutz,2,FALSE))","v":0},{"$f":"IF(L13=\"\",0,VLOOKUP(L13,PSMListe!Pflanzenschutz,2,FALSE))","v":0},{"$f":"IF(M13=\"\",0,VLOOKUP(M13,PSMListe!Pflanzenschutz,2,FALSE))","v":0},{"$f":"IF(N13=\"\",0,VLOOKUP(N13,PSMListe!Pflanzenschutz,2,FALSE))","v":0},{"$f":"IF(O13=\"\",0,VLOOKUP(O13,PSMListe!Pflanzenschutz,2,FALSE))","v":0},{"$f":"IF(P13=\"\",0,VLOOKUP(P13,PSMListe!Pflanzenschutz,2,FALSE))","v":0},{"$f":"IF(Q13=\"\",0,VLOOKUP(Q13,PSMListe!Pflanzenschutz,2,FALSE))","v":0},{"$f":"IF(R13=\"\",0,VLOOKUP(R13,PSMListe!Pflanzenschutz,2,FALSE))","v":0},{"$f":"IF(S13=\"\",0,VLOOKUP(S13,PSMListe!Pflanzenschutz,2,FALSE))","v":0},{"$f":"IF(T13=\"\",0,VLOOKUP(T13,PSMListe!Pflanzenschutz,2,FALSE))","v":0},{"$f":"IF(U13=\"\",0,VLOOKUP(U13,PSMListe!Pflanzenschutz,2,FALSE))","v":0},{"$f":"IF(V13=\"\",0,VLOOKUP(V13,PSMListe!Pflanzenschutz,2,FALSE))","v":0},{"$f":"IF(W13=\"\",0,VLOOKUP(W13,PSMListe!Pflanzenschutz,2,FALSE))","v":0},{"$f":"IF(X13=\"\",0,VLOOKUP(X13,PSMListe!Pflanzenschutz,2,FALSE))","v":0},{"$f":"IF(Y13=\"\",0,VLOOKUP(Y13,PSMListe!Pflanzenschutz,2,FALSE))","v":0},{"$f":"IF(Z13=\"\",0,VLOOKUP(Z13,PSMListe!Pflanzenschutz,2,FALSE))","v":0},{"$f":"IF(AA13=\"\",0,VLOOKUP(AA13,PSMListe!Pflanzenschutz,2,FALSE))","v":0},{"$f":"IF(AB13=\"\",0,VLOOKUP(AB13,PSMListe!Pflanzenschutz,2,FALSE))","v":0},{"$f":"IF(AC13=\"\",0,VLOOKUP(AC13,PSMListe!Pflanzenschutz,2,FALSE))","v":0},{"$f":"IF(AD13=\"\",0,VLOOKUP(AD13,PSMListe!Pflanzenschutz,2,FALSE))","v":0},{"$f":"IF(AE13=\"\",0,VLOOKUP(AE13,PSMListe!Pflanzenschutz,2,FALSE))","v":0},{"$f":"IF(AF13=\"\",0,VLOOKUP(AF13,PSMListe!Pflanzenschutz,2,FALSE))","v":0},{"$f":"IF(AG13=\"\",0,VLOOKUP(AG13,PSMListe!Pflanzenschutz,2,FALSE))","v":0},{"$f":"IF(AH13=\"\",0,VLOOKUP(AH13,PSMListe!Pflanzenschutz,2,FALSE))","v":0},{"$f":"IF(AI13=\"\",0,VLOOKUP(AI13,PSMListe!Pflanzenschutz,2,FALSE))","v":0},{"$f":"IF(AJ13=\"\",0,VLOOKUP(AJ13,PSMListe!Pflanzenschutz,2,FALSE))","v":0},{"$f":"IF(AK13=\"\",0,VLOOKUP(AK13,PSMListe!Pflanzenschutz,2,FALSE))","v":0},{"$f":"IF(AL13=\"\",0,VLOOKUP(AL13,PSMListe!Pflanzenschutz,2,FALSE))","v":0},{"$f":"IF(AM13=\"\",0,VLOOKUP(AM13,PSMListe!Pflanzenschutz,2,FALSE))","v":0},{"$f":"IF(AN13=\"\",0,VLOOKUP(AN13,PSMListe!Pflanzenschutz,2,FALSE))","v":0},{"$f":"IF(AO13=\"\",0,VLOOKUP(AO13,PSMListe!Pflanzenschutz,2,FALSE))","v":0},{"$f":"IF(AP13=\"\",0,VLOOKUP(AP13,PSMListe!Pflanzenschutz,2,FALSE))","v":0},{"$f":"IF(AQ13=\"\",0,VLOOKUP(AQ13,PSMListe!Pflanzenschutz,2,FALSE))","v":0},{"$f":"IF(AR13=\"\",0,VLOOKUP(AR13,PSMListe!Pflanzenschutz,2,FALSE))","v":0},{"$f":"IF(AS13=\"\",0,VLOOKUP(AS13,PSMListe!Pflanzenschutz,2,FALSE))","v":0},{"$f":"IF(AT13=\"\",0,VLOOKUP(AT13,PSMListe!Pflanzenschutz,2,FALSE))","v":0},{"$f":"IF(AU13=\"\",0,VLOOKUP(AU13,PSMListe!Pflanzenschutz,2,FALSE))","v":0},{"$f":"IF(AV13=\"\",0,VLOOKUP(AV13,PSMListe!Pflanzenschutz,2,FALSE))","v":0},{"$f":"IF(AW13=\"\",0,VLOOKUP(AW13,PSMListe!Pflanzenschutz,2,FALSE))","v":0},{"$f":"IF(AX13=\"\",0,VLOOKUP(AX13,PSMListe!Pflanzenschutz,2,FALSE))","v":0},{"$f":"IF(AY13=\"\",0,VLOOKUP(AY13,PSMListe!Pflanzenschutz,2,FALSE))","v":0},{"$f":"IF(AZ13=\"\",0,VLOOKUP(AZ13,PSMListe!Pflanzenschutz,2,FALSE))","v":0},{"$f":"IF(BA13=\"\",0,VLOOKUP(BA13,PSMListe!Pflanzenschutz,2,FALSE))","v":0},{"$f":"IF(BB13=\"\",0,VLOOKUP(BB13,PSMListe!Pflanzenschutz,2,FALSE))","v":0},{"$f":"IF(BC13=\"\",0,VLOOKUP(BC13,PSMListe!Pflanzenschutz,2,FALSE))","v":0},{"$f":"IF(BD13=\"\",0,VLOOKUP(BD13,PSMListe!Pflanzenschutz,2,FALSE))","v":0},{"$f":"IF(BE13=\"\",0,VLOOKUP(BE13,PSMListe!Pflanzenschutz,2,FALSE))","v":0},{"$f":"IF(BF13=\"\",0,VLOOKUP(BF13,PSMListe!Pflanzenschutz,2,FALSE))","v":0},{"$f":"IF(BG13=\"\",0,VLOOKUP(BG13,PSMListe!Pflanzenschutz,2,FALSE))","v":0},{"$f":"IF(BH13=\"\",0,VLOOKUP(BH13,PSMListe!Pflanzenschutz,2,FALSE))","v":0},{"$f":"IF(BI13=\"\",0,VLOOKUP(BI13,PSMListe!Pflanzenschutz,2,FALSE))","v":0},{"$f":"IF(BJ13=\"\",0,VLOOKUP(BJ13,PSMListe!Pflanzenschutz,2,FALSE))","v":0}]
[null,"Menge",2.5]
[null,"Bemerkung","Ralf, Pilzinfektion 42 05 er bewölkt 21°C     ","Peter"]
[null,"Datum","2018-08-07"]
[null,"Mittel 3","Cuprozin progress"]
[null,"Preis",{"$f":"IF(C18=\"\",0,VLOOKUP(C18,PSMListe!Pflanzenschutz,2,FALSE))","v":29.8},{"$f":"IF(D18=\"\",0,VLOOKUP(D18,PSMListe!Pflanzenschutz,2,FALSE))","v":0},{"$f":"IF(E18=\"\",0,VLOOKUP(E18,PSMListe!Pflanzenschutz,2,FALSE))","v":0},{"$f":"IF(F18=\"\",0,VLOOKUP(F18,PSMListe!Pflanzenschutz,2,FALSE))","v":0},{"$f":"IF(G18=\"\",0,VLOOKUP(G18,PSMListe!Pflanzenschutz,2,FALSE))","v":0},{"$f":"IF(H18=\"\",0,VLOOKUP(H18,PSMListe!Pflanzenschutz,2,FALSE))","v":0},{"$f":"IF(I18=\"\",0,VLOOKUP(I18,PSMListe!Pflanzenschutz,2,FALSE))","v":0},{"$f":"IF(J18=\"\",0,VLOOKUP(J18,PSMListe!Pflanzenschutz,2,FALSE))","v":0},{"$f":"IF(K18=\"\",0,VLOOKUP(K18,PSMListe!Pflanzenschutz,2,FALSE))","v":0},{"$f":"IF(L18=\"\",0,VLOOKUP(L18,PSMListe!Pflanzenschutz,2,FALSE))","v":0},{"$f":"IF(M18=\"\",0,VLOOKUP(M18,PSMListe!Pflanzenschutz,2,FALSE))","v":0},{"$f":"IF(N18=\"\",0,VLOOKUP(N18,PSMListe!Pflanzenschutz,2,FALSE))","v":0},{"$f":"IF(O18=\"\",0,VLOOKUP(O18,PSMListe!Pflanzenschutz,2,FALSE))","v":0},{"$f":"IF(P18=\"\",0,VLOOKUP(P18,PSMListe!Pflanzenschutz,2,FALSE))","v":0},{"$f":"IF(Q18=\"\",0,VLOOKUP(Q18,PSMListe!Pflanzenschutz,2,FALSE))","v":0},{"$f":"IF(R18=\"\",0,VLOOKUP(R18,PSMListe!Pflanzenschutz,2,FALSE))","v":0},{"$f":"IF(S18=\"\",0,VLOOKUP(S18,PSMListe!Pflanzenschutz,2,FALSE))","v":0},{"$f":"IF(T18=\"\",0,VLOOKUP(T18,PSMListe!Pflanzenschutz,2,FALSE))","v":0},{"$f":"IF(U18=\"\",0,VLOOKUP(U18,PSMListe!Pflanzenschutz,2,FALSE))","v":0},{"$f":"IF(V18=\"\",0,VLOOKUP(V18,PSMListe!Pflanzenschutz,2,FALSE))","v":0},{"$f":"IF(W18=\"\",0,VLOOKUP(W18,PSMListe!Pflanzenschutz,2,FALSE))","v":0},{"$f":"IF(X18=\"\",0,VLOOKUP(X18,PSMListe!Pflanzenschutz,2,FALSE))","v":0},{"$f":"IF(Y18=\"\",0,VLOOKUP(Y18,PSMListe!Pflanzenschutz,2,FALSE))","v":0},{"$f":"IF(Z18=\"\",0,VLOOKUP(Z18,PSMListe!Pflanzenschutz,2,FALSE))","v":0},{"$f":"IF(AA18=\"\",0,VLOOKUP(AA18,PSMListe!Pflanzenschutz,2,FALSE))","v":0},{"$f":"IF(AB18=\"\",0,VLOOKUP(AB18,PSMListe!Pflanzenschutz,2,FALSE))","v":0},{"$f":"IF(AC18=\"\",0,VLOOKUP(AC18,PSMListe!Pflanzenschutz,2,FALSE))","v":0},{"$f":"IF(AD18=\"\",0,VLOOKUP(AD18,PSMListe!Pflanzenschutz,2,FALSE))","v":0},{"$f":"IF(AE18=\"\",0,VLOOKUP(AE18,PSMListe!Pflanzenschutz,2,FALSE))","v":0},{"$f":"IF(AF18=\"\",0,VLOOKUP(AF18,PSMListe!Pflanzenschutz,2,FALSE))","v":0},{"$f":"IF(AG18=\"\",0,VLOOKUP(AG18,PSMListe!Pflanzenschutz,2,FALSE))","v":0},{"$f":"IF(AH18=\"\",0,VLOOKUP(AH18,PSMListe!Pflanzenschutz,2,FALSE))","v":0},{"$f":"IF(AI18=\"\",0,VLOOKUP(AI18,PSMListe!Pflanzenschutz,2,FALSE))","v":0},{"$f":"IF(AJ18=\"\",0,VLOOKUP(AJ18,PSMListe!Pflanzenschutz,2,FALSE))","v":0},{"$f":"IF(AK18=\"\",0,VLOOKUP(AK18,PSMListe!Pflanzenschutz,2,FALSE))","v":0},{"$f":"IF(AL18=\"\",0,VLOOKUP(AL18,PSMListe!Pflanzenschutz,2,FALSE))","v":0},{"$f":"IF(AM18=\"\",0,VLOOKUP(AM18,PSMListe!Pflanzenschutz,2,FALSE))","v":0},{"$f":"IF(AN18=\"\",0,VLOOKUP(AN18,PSMListe!Pflanzenschutz,2,FALSE))","v":0},{"$f":"IF(AO18=\"\",0,VLOOKUP(AO18,PSMListe!Pflanzenschutz,2,FALSE))","v":0},{"$f":"IF(AP18=\"\",0,VLOOKUP(AP18,PSMListe!Pflanzenschutz,2,FALSE))","v":0},{"$f":"IF(AQ18=\"\",0,VLOOKUP(AQ18,PSMListe!Pflanzenschutz,2,FALSE))","v":0},{"$f":"IF(AR18=\"\",0,VLOOKUP(AR18,PSMListe!Pflanzenschutz,2,FALSE))","v":0},{"$f":"IF(AS18=\"\",0,VLOOKUP(AS18,PSMListe!Pflanzenschutz,2,FALSE))","v":0},{"$f":"IF(AT18=\"\",0,VLOOKUP(AT18,PSMListe!Pflanzenschutz,2,FALSE))","v":0},{"$f":"IF(AU18=\"\",0,VLOOKUP(AU18,PSMListe!Pflanzenschutz,2,FALSE))","v":0},{"$f":"IF(AV18=\"\",0,VLOOKUP(AV18,PSMListe!Pflanzenschutz,2,FALSE))","v":0},{"$f":"IF(AW18=\"\",0,VLOOKUP(AW18,PSMListe!Pflanzenschutz,2,FALSE))","v":0},{"$f":"IF(AX18=\"\",0,VLOOKUP(AX18,PSMListe!Pflanzenschutz,2,FALSE))","v":0},{"$f":"IF(AY18=\"\",0,VLOOKUP(AY18,PSMListe!Pflanzenschutz,2,FALSE))","v":0},{"$f":"IF(AZ18=\"\",0,VLOOKUP(AZ18,PSMListe!Pflanzenschutz,2,FALSE))","v":0},{"$f":"IF(BA18=\"\",0,VLOOKUP(BA18,PSMListe!Pflanzenschutz,2,FALSE))","v":0},{"$f":"IF(BB18=\"\",0,VLOOKUP(BB18,PSMListe!Pflanzenschutz,2,FALSE))","v":0},{"$f":"IF(BC18=\"\",0,VLOOKUP(BC18,PSMListe!Pflanzenschutz,2,FALSE))","v":0},{"$f":"IF(BD18=\"\",0,VLOOKUP(BD18,PSMListe!Pflanzenschutz,2,FALSE))","v":0},{"$f":"IF(BE18=\"\",0,VLOOKUP(BE18,PSMListe!Pflanzenschutz,2,FALSE))","v":0},{"$f":"IF(BF18=\"\",0,VLOOKUP(BF18,PSMListe!Pflanzenschutz,2,FALSE))","v":0},{"$f":"IF(BG18=\"\",0,VLOOKUP(BG18,PSMListe!Pflanzenschutz,2,FALSE))","v":0},{"$f":"IF(BH18=\"\",0,VLOOKUP(BH18,PSMListe!Pflanzenschutz,2,FALSE))","v":0},{"$f":"IF(BI18=\"\",0,VLOOKUP(BI18,PSMListe!Pflanzenschutz,2,FALSE))","v":0},{"$f":"IF(BJ18=\"\",0,VLOOKUP(BJ18,PSMListe!Pflanzenschutz,2,FALSE))","v":0}]
[null,"Menge",2]
[null,"Bemerkung","Ralf, Stemphylium 55 6 er bewölkt 21°C     "]
[null,"Datum","2018-08-28"]
[null,"Mittel 4","Amistar Opti"]
[null,"Preis",{"$f":"IF(C23=\"\",0,VLOOKUP(C23,PSMListe!Pflanzenschutz,2,FALSE))","v":18.600000000000001},{"$f":"IF(D23=\"\",0,VLOOKUP(D23,PSMListe!Pflanzenschutz,2,FALSE))","v":0},{"$f":"IF(E23=\"\",0,VLOOKUP(E23,PSMListe!Pflanzenschutz,2,FALSE))","v":0},{"$f":"IF(F23=\"\",0,VLOOKUP(F23,PSMListe!Pflanzenschutz,2,FALSE))","v":0},{"$f":"IF(G23=\"\",0,VLOOKUP(G23,PSMListe!Pflanzenschutz,2,FALSE))","v":0},{"$f":"IF(H23=\"\",0,VLOOKUP(H23,PSMListe!Pflanzenschutz,2,FALSE))","v":0},{"$f":"IF(I23=\"\",0,VLOOKUP(I23,PSMListe!Pflanzenschutz,2,FALSE))","v":0},{"$f":"IF(J23=\"\",0,VLOOKUP(J23,PSMListe!Pflanzenschutz,2,FALSE))","v":0},{"$f":"IF(K23=\"\",0,VLOOKUP(K23,PSMListe!Pflanzenschutz,2,FALSE))","v":0},{"$f":"IF(L23=\"\",0,VLOOKUP(L23,PSMListe!Pflanzenschutz,2,FALSE))","v":0},{"$f":"IF(M23=\"\",0,VLOOKUP(M23,PSMListe!Pflanzenschutz,2,FALSE))","v":0},{"$f":"IF(N23=\"\",0,VLOOKUP(N23,PSMListe!Pflanzenschutz,2,FALSE))","v":0},{"$f":"IF(O23=\"\",0,VLOOKUP(O23,PSMListe!Pflanzenschutz,2,FALSE))","v":0},{"$f":"IF(P23=\"\",0,VLOOKUP(P23,PSMListe!Pflanzenschutz,2,FALSE))","v":0},{"$f":"IF(Q23=\"\",0,VLOOKUP(Q23,PSMListe!Pflanzenschutz,2,FALSE))","v":0},{"$f":"IF(R23=\"\",0,VLOOKUP(R23,PSMListe!Pflanzenschutz,2,FALSE))","v":0},{"$f":"IF(S23=\"\",0,VLOOKUP(S23,PSMListe!Pflanzenschutz,2,FALSE))","v":0},{"$f":"IF(T23=\"\",0,VLOOKUP(T23,PSMListe!Pflanzenschutz,2,FALSE))","v":0},{"$f":"IF(U23=\"\",0,VLOOKUP(U23,PSMListe!Pflanzenschutz,2,FALSE))","v":0},{"$f":"IF(V23=\"\",0,VLOOKUP(V23,PSMListe!Pflanzenschutz,2,FALSE))","v":0},{"$f":"IF(W23=\"\",0,VLOOKUP(W23,PSMListe!Pflanzenschutz,2,FALSE))","v":0},{"$f":"IF(X23=\"\",0,VLOOKUP(X23,PSMListe!Pflanzenschutz,2,FALSE))","v":0},{"$f":"IF(Y23=\"\",0,VLOOKUP(Y23,PSMListe!Pflanzenschutz,2,FALSE))","v":0},{"$f":"IF(Z23=\"\",0,VLOOKUP(Z23,PSMListe!Pflanzenschutz,2,FALSE))","v":0},{"$f":"IF(AA23=\"\",0,VLOOKUP(AA23,PSMListe!Pflanzenschutz,2,FALSE))","v":0},{"$f":"IF(AB23=\"\",0,VLOOKUP(AB23,PSMListe!Pflanzenschutz,2,FALSE))","v":0},{"$f":"IF(AC23=\"\",0,VLOOKUP(AC23,PSMListe!Pflanzenschutz,2,FALSE))","v":0},{"$f":"IF(AD23=\"\",0,VLOOKUP(AD23,PSMListe!Pflanzenschutz,2,FALSE))","v":0},{"$f":"IF(AE23=\"\",0,VLOOKUP(AE23,PSMListe!Pflanzenschutz,2,FALSE))","v":0},{"$f":"IF(AF23=\"\",0,VLOOKUP(AF23,PSMListe!Pflanzenschutz,2,FALSE))","v":0},{"$f":"IF(AG23=\"\",0,VLOOKUP(AG23,PSMListe!Pflanzenschutz,2,FALSE))","v":0},{"$f":"IF(AH23=\"\",0,VLOOKUP(AH23,PSMListe!Pflanzenschutz,2,FALSE))","v":0},{"$f":"IF(AI23=\"\",0,VLOOKUP(AI23,PSMListe!Pflanzenschutz,2,FALSE))","v":0},{"$f":"IF(AJ23=\"\",0,VLOOKUP(AJ23,PSMListe!Pflanzenschutz,2,FALSE))","v":0},{"$f":"IF(AK23=\"\",0,VLOOKUP(AK23,PSMListe!Pflanzenschutz,2,FALSE))","v":0},{"$f":"IF(AL23=\"\",0,VLOOKUP(AL23,PSMListe!Pflanzenschutz,2,FALSE))","v":0},{"$f":"IF(AM23=\"\",0,VLOOKUP(AM23,PSMListe!Pflanzenschutz,2,FALSE))","v":0},{"$f":"IF(AN23=\"\",0,VLOOKUP(AN23,PSMListe!Pflanzenschutz,2,FALSE))","v":0},{"$f":"IF(AO23=\"\",0,VLOOKUP(AO23,PSMListe!Pflanzenschutz,2,FALSE))","v":0},{"$f":"IF(AP23=\"\",0,VLOOKUP(AP23,PSMListe!Pflanzenschutz,2,FALSE))","v":0},{"$f":"IF(AQ23=\"\",0,VLOOKUP(AQ23,PSMListe!Pflanzenschutz,2,FALSE))","v":0},{"$f":"IF(AR23=\"\",0,VLOOKUP(AR23,PSMListe!Pflanzenschutz,2,FALSE))","v":0},{"$f":"IF(AS23=\"\",0,VLOOKUP(AS23,PSMListe!Pflanzenschutz,2,FALSE))","v":0},{"$f":"IF(AT23=\"\",0,VLOOKUP(AT23,PSMListe!Pflanzenschutz,2,FALSE))","v":0},{"$f":"IF(AU23=\"\",0,VLOOKUP(AU23,PSMListe!Pflanzenschutz,2,FALSE))","v":0},{"$f":"IF(AV23=\"\",0,VLOOKUP(AV23,PSMListe!Pflanzenschutz,2,FALSE))","v":0},{"$f":"IF(AW23=\"\",0,VLOOKUP(AW23,PSMListe!Pflanzenschutz,2,FALSE))","v":0},{"$f":"IF(AX23=\"\",0,VLOOKUP(AX23,PSMListe!Pflanzenschutz,2,FALSE))","v":0},{"$f":"IF(AY23=\"\",0,VLOOKUP(AY23,PSMListe!Pflanzenschutz,2,FALSE))","v":0},{"$f":"IF(AZ23=\"\",0,VLOOKUP(AZ23,PSMListe!Pflanzenschutz,2,FALSE))","v":0},{"$f":"IF(BA23=\"\",0,VLOOKUP(BA23,PSMListe!Pflanzenschutz,2,FALSE))","v":0},{"$f":"IF(BB23=\"\",0,VLOOKUP(BB23,PSMListe!Pflanzenschutz,2,FALSE))","v":0},{"$f":"IF(BC23=\"\",0,VLOOKUP(BC23,PSMListe!Pflanzenschutz,2,FALSE))","v":0},{"$f":"IF(BD23=\"\",0,VLOOKUP(BD23,PSMListe!Pflanzenschutz,2,FALSE))","v":0},{"$f":"IF(BE23=\"\",0,VLOOKUP(BE23,PSMListe!Pflanzenschutz,2,FALSE))","v":0},{"$f":"IF(BF23=\"\",0,VLOOKUP(BF23,PSMListe!Pflanzenschutz,2,FALSE))","v":0},{"$f":"IF(BG23=\"\",0,VLOOKUP(BG23,PSMListe!Pflanzenschutz,2,FALSE))","v":0},{"$f":"IF(BH23=\"\",0,VLOOKUP(BH23,PSMListe!Pflanzenschutz,2,FALSE))","v":0},{"$f":"IF(BI23=\"\",0,VLOOKUP(BI23,PSMListe!Pflanzenschutz,2,FALSE))","v":0},{"$f":"IF(BJ23=\"\",0,VLOOKUP(BJ23,PSMListe!Pflanzenschutz,2,FALSE))","v":0}]
[null,"Menge",2.5]
[null,"Bemerkung","Ralf, Stemphylium 42 05 er bewölkt 21°C     "]
[null,"Datum","2018-08-28"]
[null,"Mittel 5","Buctril 0,5 + Sencor liquid 0,5"]
[null,"Preis",{"$f":"IF(C28=\"\",0,VLOOKUP(C28,PSMListe!Pflanzenschutz,2,FALSE))","v":19.149999999999999},{"$f":"IF(D28=\"\",0,VLOOKUP(D28,PSMListe!Pflanzenschutz,2,FALSE))","v":0},{"$f":"IF(E28=\"\",0,VLOOKUP(E28,PSMListe!Pflanzenschutz,2,FALSE))","v":0},{"$f":"IF(F28=\"\",0,VLOOKUP(F28,PSMListe!Pflanzenschutz,2,FALSE))","v":0},{"$f":"IF(G28=\"\",0,VLOOKUP(G28,PSMListe!Pflanzenschutz,2,FALSE))","v":0},{"$f":"IF(H28=\"\",0,VLOOKUP(H28,PSMListe!Pflanzenschutz,2,FALSE))","v":0},{"$f":"IF(I28=\"\",0,VLOOKUP(I28,PSMListe!Pflanzenschutz,2,FALSE))","v":0},{"$f":"IF(J28=\"\",0,VLOOKUP(J28,PSMListe!Pflanzenschutz,2,FALSE))","v":0},{"$f":"IF(K28=\"\",0,VLOOKUP(K28,PSMListe!Pflanzenschutz,2,FALSE))","v":0},{"$f":"IF(L28=\"\",0,VLOOKUP(L28,PSMListe!Pflanzenschutz,2,FALSE))","v":0},{"$f":"IF(M28=\"\",0,VLOOKUP(M28,PSMListe!Pflanzenschutz,2,FALSE))","v":0},{"$f":"IF(N28=\"\",0,VLOOKUP(N28,PSMListe!Pflanzenschutz,2,FALSE))","v":0},{"$f":"IF(O28=\"\",0,VLOOKUP(O28,PSMListe!Pflanzenschutz,2,FALSE))","v":0},{"$f":"IF(P28=\"\",0,VLOOKUP(P28,PSMListe!Pflanzenschutz,2,FALSE))","v":0},{"$f":"IF(Q28=\"\",0,VLOOKUP(Q28,PSMListe!Pflanzenschutz,2,FALSE))","v":0},{"$f":"IF(R28=\"\",0,VLOOKUP(R28,PSMListe!Pflanzenschutz,2,FALSE))","v":0},{"$f":"IF(S28=\"\",0,VLOOKUP(S28,PSMListe!Pflanzenschutz,2,FALSE))","v":0},{"$f":"IF(T28=\"\",0,VLOOKUP(T28,PSMListe!Pflanzenschutz,2,FALSE))","v":0},{"$f":"IF(U28=\"\",0,VLOOKUP(U28,PSMListe!Pflanzenschutz,2,FALSE))","v":0},{"$f":"IF(V28=\"\",0,VLOOKUP(V28,PSMListe!Pflanzenschutz,2,FALSE))","v":0},{"$f":"IF(W28=\"\",0,VLOOKUP(W28,PSMListe!Pflanzenschutz,2,FALSE))","v":0},{"$f":"IF(X28=\"\",0,VLOOKUP(X28,PSMListe!Pflanzenschutz,2,FALSE))","v":0},{"$f":"IF(Y28=\"\",0,VLOOKUP(Y28,PSMListe!Pflanzenschutz,2,FALSE))","v":0},{"$f":"IF(Z28=\"\",0,VLOOKUP(Z28,PSMListe!Pflanzenschutz,2,FALSE))","v":0},{"$f":"IF(AA28=\"\",0,VLOOKUP(AA28,PSMListe!Pflanzenschutz,2,FALSE))","v":0},{"$f":"IF(AB28=\"\",0,VLOOKUP(AB28,PSMListe!Pflanzenschutz,2,FALSE))","v":0},{"$f":"IF(AC28=\"\",0,VLOOKUP(AC28,PSMListe!Pflanzenschutz,2,FALSE))","v":0},{"$f":"IF(AD28=\"\",0,VLOOKUP(AD28,PSMListe!Pflanzenschutz,2,FALSE))","v":0},{"$f":"IF(AE28=\"\",0,VLOOKUP(AE28,PSMListe!Pflanzenschutz,2,FALSE))","v":0},{"$f":"IF(AF28=\"\",0,VLOOKUP(AF28,PSMListe!Pflanzenschutz,2,FALSE))","v":0},{"$f":"IF(AG28=\"\",0,VLOOKUP(AG28,PSMListe!Pflanzenschutz,2,FALSE))","v":0},{"$f":"IF(AH28=\"\",0,VLOOKUP(AH28,PSMListe!Pflanzenschutz,2,FALSE))","v":0},{"$f":"IF(AI28=\"\",0,VLOOKUP(AI28,PSMListe!Pflanzenschutz,2,FALSE))","v":0},{"$f":"IF(AJ28=\"\",0,VLOOKUP(AJ28,PSMListe!Pflanzenschutz,2,FALSE))","v":0},{"$f":"IF(AK28=\"\",0,VLOOKUP(AK28,PSMListe!Pflanzenschutz,2,FALSE))","v":0},{"$f":"IF(AL28=\"\",0,VLOOKUP(AL28,PSMListe!Pflanzenschutz,2,FALSE))","v":0},{"$f":"IF(AM28=\"\",0,VLOOKUP(AM28,PSMListe!Pflanzenschutz,2,FALSE))","v":0},{"$f":"IF(AN28=\"\",0,VLOOKUP(AN28,PSMListe!Pflanzenschutz,2,FALSE))","v":0},{"$f":"IF(AO28=\"\",0,VLOOKUP(AO28,PSMListe!Pflanzenschutz,2,FALSE))","v":0},{"$f":"IF(AP28=\"\",0,VLOOKUP(AP28,PSMListe!Pflanzenschutz,2,FALSE))","v":0},{"$f":"IF(AQ28=\"\",0,VLOOKUP(AQ28,PSMListe!Pflanzenschutz,2,FALSE))","v":0},{"$f":"IF(AR28=\"\",0,VLOOKUP(AR28,PSMListe!Pflanzenschutz,2,FALSE))","v":0},{"$f":"IF(AS28=\"\",0,VLOOKUP(AS28,PSMListe!Pflanzenschutz,2,FALSE))","v":0},{"$f":"IF(AT28=\"\",0,VLOOKUP(AT28,PSMListe!Pflanzenschutz,2,FALSE))","v":0},{"$f":"IF(AU28=\"\",0,VLOOKUP(AU28,PSMListe!Pflanzenschutz,2,FALSE))","v":0},{"$f":"IF(AV28=\"\",0,VLOOKUP(AV28,PSMListe!Pflanzenschutz,2,FALSE))","v":0},{"$f":"IF(AW28=\"\",0,VLOOKUP(AW28,PSMListe!Pflanzenschutz,2,FALSE))","v":0},{"$f":"IF(AX28=\"\",0,VLOOKUP(AX28,PSMListe!Pflanzenschutz,2,FALSE))","v":0},{"$f":"IF(AY28=\"\",0,VLOOKUP(AY28,PSMListe!Pflanzenschutz,2,FALSE))","v":0},{"$f":"IF(AZ28=\"\",0,VLOOKUP(AZ28,PSMListe!Pflanzenschutz,2,FALSE))","v":0},{"$f":"IF(BA28=\"\",0,VLOOKUP(BA28,PSMListe!Pflanzenschutz,2,FALSE))","v":0},{"$f":"IF(BB28=\"\",0,VLOOKUP(BB28,PSMListe!Pflanzenschutz,2,FALSE))","v":0},{"$f":"IF(BC28=\"\",0,VLOOKUP(BC28,PSMListe!Pflanzenschutz,2,FALSE))","v":0},{"$f":"IF(BD28=\"\",0,VLOOKUP(BD28,PSMListe!Pflanzenschutz,2,FALSE))","v":0},{"$f":"IF(BE28=\"\",0,VLOOKUP(BE28,PSMListe!Pflanzenschutz,2,FALSE))","v":0},{"$f":"IF(BF28=\"\",0,VLOOKUP(BF28,PSMListe!Pflanzenschutz,2,FALSE))","v":0},{"$f":"IF(BG28=\"\",0,VLOOKUP(BG28,PSMListe!Pflanzenschutz,2,FALSE))","v":0},{"$f":"IF(BH28=\"\",0,VLOOKUP(BH28,PSMListe!Pflanzenschutz,2,FALSE))","v":0},{"$f":"IF(BI28=\"\",0,VLOOKUP(BI28,PSMListe!Pflanzenschutz,2,FALSE))","v":0},{"$f":"IF(BJ28=\"\",0,VLOOKUP(BJ28,PSMListe!Pflanzenschutz,2,FALSE))","v":0}]
[null,"Menge",1]
[null,"Bemerkung"]
[null,"Datum","2018-08-28"]
[null,"Mittel 6","Karate Zeon"]
[null,"Preis",{"$f":"IF(C33=\"\",0,VLOOKUP(C33,PSMListe!Pflanzenschutz,2,FALSE))","v":137.30000000000001},{"$f":"IF(D33=\"\",0,VLOOKUP(D33,PSMListe!Pflanzenschutz,2,FALSE))","v":0},{"$f":"IF(E33=\"\",0,VLOOKUP(E33,PSMListe!Pflanzenschutz,2,FALSE))","v":0},{"$f":"IF(F33=\"\",0,VLOOKUP(F33,PSMListe!Pflanzenschutz,2,FALSE))","v":0},{"$f":"IF(G33=\"\",0,VLOOKUP(G33,PSMListe!Pflanzenschutz,2,FALSE))","v":0},{"$f":"IF(H33=\"\",0,VLOOKUP(H33,PSMListe!Pflanzenschutz,2,FALSE))","v":0},{"$f":"IF(I33=\"\",0,VLOOKUP(I33,PSMListe!Pflanzenschutz,2,FALSE))","v":0},{"$f":"IF(J33=\"\",0,VLOOKUP(J33,PSMListe!Pflanzenschutz,2,FALSE))","v":0},{"$f":"IF(K33=\"\",0,VLOOKUP(K33,PSMListe!Pflanzenschutz,2,FALSE))","v":0},{"$f":"IF(L33=\"\",0,VLOOKUP(L33,PSMListe!Pflanzenschutz,2,FALSE))","v":0},{"$f":"IF(M33=\"\",0,VLOOKUP(M33,PSMListe!Pflanzenschutz,2,FALSE))","v":0},{"$f":"IF(N33=\"\",0,VLOOKUP(N33,PSMListe!Pflanzenschutz,2,FALSE))","v":0},{"$f":"IF(O33=\"\",0,VLOOKUP(O33,PSMListe!Pflanzenschutz,2,FALSE))","v":0},{"$f":"IF(P33=\"\",0,VLOOKUP(P33,PSMListe!Pflanzenschutz,2,FALSE))","v":0},{"$f":"IF(Q33=\"\",0,VLOOKUP(Q33,PSMListe!Pflanzenschutz,2,FALSE))","v":0},{"$f":"IF(R33=\"\",0,VLOOKUP(R33,PSMListe!Pflanzenschutz,2,FALSE))","v":0},{"$f":"IF(S33=\"\",0,VLOOKUP(S33,PSMListe!Pflanzenschutz,2,FALSE))","v":0},{"$f":"IF(T33=\"\",0,VLOOKUP(T33,PSMListe!Pflanzenschutz,2,FALSE))","v":0},{"$f":"IF(U33=\"\",0,VLOOKUP(U33,PSMListe!Pflanzenschutz,2,FALSE))","v":0},{"$f":"IF(V33=\"\",0,VLOOKUP(V33,PSMListe!Pflanzenschutz,2,FALSE))","v":0},{"$f":"IF(W33=\"\",0,VLOOKUP(W33,PSMListe!Pflanzenschutz,2,FALSE))","v":0},{"$f":"IF(X33=\"\",0,VLOOKUP(X33,PSMListe!Pflanzenschutz,2,FALSE))","v":0},{"$f":"IF(Y33=\"\",0,VLOOKUP(Y33,PSMListe!Pflanzenschutz,2,FALSE))","v":0},{"$f":"IF(Z33=\"\",0,VLOOKUP(Z33,PSMListe!Pflanzenschutz,2,FALSE))","v":0},{"$f":"IF(AA33=\"\",0,VLOOKUP(AA33,PSMListe!Pflanzenschutz,2,FALSE))","v":0},{"$f":"IF(AB33=\"\",0,VLOOKUP(AB33,PSMListe!Pflanzenschutz,2,FALSE))","v":0},{"$f":"IF(AC33=\"\",0,VLOOKUP(AC33,PSMListe!Pflanzenschutz,2,FALSE))","v":0},{"$f":"IF(AD33=\"\",0,VLOOKUP(AD33,PSMListe!Pflanzenschutz,2,FALSE))","v":0},{"$f":"IF(AE33=\"\",0,VLOOKUP(AE33,PSMListe!Pflanzenschutz,2,FALSE))","v":0},{"$f":"IF(AF33=\"\",0,VLOOKUP(AF33,PSMListe!Pflanzenschutz,2,FALSE))","v":0},{"$f":"IF(AG33=\"\",0,VLOOKUP(AG33,PSMListe!Pflanzenschutz,2,FALSE))","v":0},{"$f":"IF(AH33=\"\",0,VLOOKUP(AH33,PSMListe!Pflanzenschutz,2,FALSE))","v":0},{"$f":"IF(AI33=\"\",0,VLOOKUP(AI33,PSMListe!Pflanzenschutz,2,FALSE))","v":0},{"$f":"IF(AJ33=\"\",0,VLOOKUP(AJ33,PSMListe!Pflanzenschutz,2,FALSE))","v":0},{"$f":"IF(AK33=\"\",0,VLOOKUP(AK33,PSMListe!Pflanzenschutz,2,FALSE))","v":0},{"$f":"IF(AL33=\"\",0,VLOOKUP(AL33,PSMListe!Pflanzenschutz,2,FALSE))","v":0},{"$f":"IF(AM33=\"\",0,VLOOKUP(AM33,PSMListe!Pflanzenschutz,2,FALSE))","v":0},{"$f":"IF(AN33=\"\",0,VLOOKUP(AN33,PSMListe!Pflanzenschutz,2,FALSE))","v":0},{"$f":"IF(AO33=\"\",0,VLOOKUP(AO33,PSMListe!Pflanzenschutz,2,FALSE))","v":0},{"$f":"IF(AP33=\"\",0,VLOOKUP(AP33,PSMListe!Pflanzenschutz,2,FALSE))","v":0},{"$f":"IF(AQ33=\"\",0,VLOOKUP(AQ33,PSMListe!Pflanzenschutz,2,FALSE))","v":0},{"$f":"IF(AR33=\"\",0,VLOOKUP(AR33,PSMListe!Pflanzenschutz,2,FALSE))","v":0},{"$f":"IF(AS33=\"\",0,VLOOKUP(AS33,PSMListe!Pflanzenschutz,2,FALSE))","v":0},{"$f":"IF(AT33=\"\",0,VLOOKUP(AT33,PSMListe!Pflanzenschutz,2,FALSE))","v":0},{"$f":"IF(AU33=\"\",0,VLOOKUP(AU33,PSMListe!Pflanzenschutz,2,FALSE))","v":0},{"$f":"IF(AV33=\"\",0,VLOOKUP(AV33,PSMListe!Pflanzenschutz,2,FALSE))","v":0},{"$f":"IF(AW33=\"\",0,VLOOKUP(AW33,PSMListe!Pflanzenschutz,2,FALSE))","v":0},{"$f":"IF(AX33=\"\",0,VLOOKUP(AX33,PSMListe!Pflanzenschutz,2,FALSE))","v":0},{"$f":"IF(AY33=\"\",0,VLOOKUP(AY33,PSMListe!Pflanzenschutz,2,FALSE))","v":0},{"$f":"IF(AZ33=\"\",0,VLOOKUP(AZ33,PSMListe!Pflanzenschutz,2,FALSE))","v":0},{"$f":"IF(BA33=\"\",0,VLOOKUP(BA33,PSMListe!Pflanzenschutz,2,FALSE))","v":0},{"$f":"IF(BB33=\"\",0,VLOOKUP(BB33,PSMListe!Pflanzenschutz,2,FALSE))","v":0},{"$f":"IF(BC33=\"\",0,VLOOKUP(BC33,PSMListe!Pflanzenschutz,2,FALSE))","v":0},{"$f":"IF(BD33=\"\",0,VLOOKUP(BD33,PSMListe!Pflanzenschutz,2,FALSE))","v":0},{"$f":"IF(BE33=\"\",0,VLOOKUP(BE33,PSMListe!Pflanzenschutz,2,FALSE))","v":0},{"$f":"IF(BF33=\"\",0,VLOOKUP(BF33,PSMListe!Pflanzenschutz,2,FALSE))","v":0},{"$f":"IF(BG33=\"\",0,VLOOKUP(BG33,PSMListe!Pflanzenschutz,2,FALSE))","v":0},{"$f":"IF(BH33=\"\",0,VLOOKUP(BH33,PSMListe!Pflanzenschutz,2,FALSE))","v":0},{"$f":"IF(BI33=\"\",0,VLOOKUP(BI33,PSMListe!Pflanzenschutz,2,FALSE))","v":0},{"$f":"IF(BJ33=\"\",0,VLOOKUP(BJ33,PSMListe!Pflanzenschutz,2,FALSE))","v":0}]
[null,"Menge",7.4999999999999997E-2]
[null,"Bemerkung","Ralf, Spargelhähnchen, 60 04 er bewölkt 24°C     "]
[null,"Datum"]
[null,"Mittel 7"]
[null,"Preis",{"$f":"IF(C38=\"\",0,VLOOKUP(C38,PSMListe!Pflanzenschutz,2,FALSE))","v":0},{"$f":"IF(D38=\"\",0,VLOOKUP(D38,PSMListe!Pflanzenschutz,2,FALSE))","v":0},{"$f":"IF(E38=\"\",0,VLOOKUP(E38,PSMListe!Pflanzenschutz,2,FALSE))","v":0},{"$f":"IF(F38=\"\",0,VLOOKUP(F38,PSMListe!Pflanzenschutz,2,FALSE))","v":0},{"$f":"IF(G38=\"\",0,VLOOKUP(G38,PSMListe!Pflanzenschutz,2,FALSE))","v":0},{"$f":"IF(H38=\"\",0,VLOOKUP(H38,PSMListe!Pflanzenschutz,2,FALSE))","v":0},{"$f":"IF(I38=\"\",0,VLOOKUP(I38,PSMListe!Pflanzenschutz,2,FALSE))","v":0},{"$f":"IF(J38=\"\",0,VLOOKUP(J38,PSMListe!Pflanzenschutz,2,FALSE))","v":0},{"$f":"IF(K38=\"\",0,VLOOKUP(K38,PSMListe!Pflanzenschutz,2,FALSE))","v":0},{"$f":"IF(L38=\"\",0,VLOOKUP(L38,PSMListe!Pflanzenschutz,2,FALSE))","v":0},{"$f":"IF(M38=\"\",0,VLOOKUP(M38,PSMListe!Pflanzenschutz,2,FALSE))","v":0},{"$f":"IF(N38=\"\",0,VLOOKUP(N38,PSMListe!Pflanzenschutz,2,FALSE))","v":0},{"$f":"IF(O38=\"\",0,VLOOKUP(O38,PSMListe!Pflanzenschutz,2,FALSE))","v":0},{"$f":"IF(P38=\"\",0,VLOOKUP(P38,PSMListe!Pflanzenschutz,2,FALSE))","v":0},{"$f":"IF(Q38=\"\",0,VLOOKUP(Q38,PSMListe!Pflanzenschutz,2,FALSE))","v":0},{"$f":"IF(R38=\"\",0,VLOOKUP(R38,PSMListe!Pflanzenschutz,2,FALSE))","v":0},{"$f":"IF(S38=\"\",0,VLOOKUP(S38,PSMListe!Pflanzenschutz,2,FALSE))","v":0},{"$f":"IF(T38=\"\",0,VLOOKUP(T38,PSMListe!Pflanzenschutz,2,FALSE))","v":0},{"$f":"IF(U38=\"\",0,VLOOKUP(U38,PSMListe!Pflanzenschutz,2,FALSE))","v":0},{"$f":"IF(V38=\"\",0,VLOOKUP(V38,PSMListe!Pflanzenschutz,2,FALSE))","v":0},{"$f":"IF(W38=\"\",0,VLOOKUP(W38,PSMListe!Pflanzenschutz,2,FALSE))","v":0},{"$f":"IF(X38=\"\",0,VLOOKUP(X38,PSMListe!Pflanzenschutz,2,FALSE))","v":0},{"$f":"IF(Y38=\"\",0,VLOOKUP(Y38,PSMListe!Pflanzenschutz,2,FALSE))","v":0},{"$f":"IF(Z38=\"\",0,VLOOKUP(Z38,PSMListe!Pflanzenschutz,2,FALSE))","v":0},{"$f":"IF(AA38=\"\",0,VLOOKUP(AA38,PSMListe!Pflanzenschutz,2,FALSE))","v":0},{"$f":"IF(AB38=\"\",0,VLOOKUP(AB38,PSMListe!Pflanzenschutz,2,FALSE))","v":0},{"$f":"IF(AC38=\"\",0,VLOOKUP(AC38,PSMListe!Pflanzenschutz,2,FALSE))","v":0},{"$f":"IF(AD38=\"\",0,VLOOKUP(AD38,PSMListe!Pflanzenschutz,2,FALSE))","v":0},{"$f":"IF(AE38=\"\",0,VLOOKUP(AE38,PSMListe!Pflanzenschutz,2,FALSE))","v":0},{"$f":"IF(AF38=\"\",0,VLOOKUP(AF38,PSMListe!Pflanzenschutz,2,FALSE))","v":0},{"$f":"IF(AG38=\"\",0,VLOOKUP(AG38,PSMListe!Pflanzenschutz,2,FALSE))","v":0},{"$f":"IF(AH38=\"\",0,VLOOKUP(AH38,PSMListe!Pflanzenschutz,2,FALSE))","v":0},{"$f":"IF(AI38=\"\",0,VLOOKUP(AI38,PSMListe!Pflanzenschutz,2,FALSE))","v":0},{"$f":"IF(AJ38=\"\",0,VLOOKUP(AJ38,PSMListe!Pflanzenschutz,2,FALSE))","v":0},{"$f":"IF(AK38=\"\",0,VLOOKUP(AK38,PSMListe!Pflanzenschutz,2,FALSE))","v":0},{"$f":"IF(AL38=\"\",0,VLOOKUP(AL38,PSMListe!Pflanzenschutz,2,FALSE))","v":0},{"$f":"IF(AM38=\"\",0,VLOOKUP(AM38,PSMListe!Pflanzenschutz,2,FALSE))","v":0},{"$f":"IF(AN38=\"\",0,VLOOKUP(AN38,PSMListe!Pflanzenschutz,2,FALSE))","v":0},{"$f":"IF(AO38=\"\",0,VLOOKUP(AO38,PSMListe!Pflanzenschutz,2,FALSE))","v":0},{"$f":"IF(AP38=\"\",0,VLOOKUP(AP38,PSMListe!Pflanzenschutz,2,FALSE))","v":0},{"$f":"IF(AQ38=\"\",0,VLOOKUP(AQ38,PSMListe!Pflanzenschutz,2,FALSE))","v":0},{"$f":"IF(AR38=\"\",0,VLOOKUP(AR38,PSMListe!Pflanzenschutz,2,FALSE))","v":0},{"$f":"IF(AS38=\"\",0,VLOOKUP(AS38,PSMListe!Pflanzenschutz,2,FALSE))","v":0},{"$f":"IF(AT38=\"\",0,VLOOKUP(AT38,PSMListe!Pflanzenschutz,2,FALSE))","v":0},{"$f":"IF(AU38=\"\",0,VLOOKUP(AU38,PSMListe!Pflanzenschutz,2,FALSE))","v":0},{"$f":"IF(AV38=\"\",0,VLOOKUP(AV38,PSMListe!Pflanzenschutz,2,FALSE))","v":0},{"$f":"IF(AW38=\"\",0,VLOOKUP(AW38,PSMListe!Pflanzenschutz,2,FALSE))","v":0},{"$f":"IF(AX38=\"\",0,VLOOKUP(AX38,PSMListe!Pflanzenschutz,2,FALSE))","v":0},{"$f":"IF(AY38=\"\",0,VLOOKUP(AY38,PSMListe!Pflanzenschutz,2,FALSE))","v":0},{"$f":"IF(AZ38=\"\",0,VLOOKUP(AZ38,PSMListe!Pflanzenschutz,2,FALSE))","v":0},{"$f":"IF(BA38=\"\",0,VLOOKUP(BA38,PSMListe!Pflanzenschutz,2,FALSE))","v":0},{"$f":"IF(BB38=\"\",0,VLOOKUP(BB38,PSMListe!Pflanzenschutz,2,FALSE))","v":0},{"$f":"IF(BC38=\"\",0,VLOOKUP(BC38,PSMListe!Pflanzenschutz,2,FALSE))","v":0},{"$f":"IF(BD38=\"\",0,VLOOKUP(BD38,PSMListe!Pflanzenschutz,2,FALSE))","v":0},{"$f":"IF(BE38=\"\",0,VLOOKUP(BE38,PSMListe!Pflanzenschutz,2,FALSE))","v":0},{"$f":"IF(BF38=\"\",0,VLOOKUP(BF38,PSMListe!Pflanzenschutz,2,FALSE))","v":0},{"$f":"IF(BG38=\"\",0,VLOOKUP(BG38,PSMListe!Pflanzenschutz,2,FALSE))","v":0},{"$f":"IF(BH38=\"\",0,VLOOKUP(BH38,PSMListe!Pflanzenschutz,2,FALSE))","v":0},{"$f":"IF(BI38=\"\",0,VLOOKUP(BI38,PSMListe!Pflanzenschutz,2,FALSE))","v":0},{"$f":"IF(BJ38=\"\",0,VLOOKUP(BJ38,PSMListe!Pflanzenschutz,2,FALSE))","v":0}]
[null,"Menge"]
[null,"Bemerkung"]
[null,"Datum"]
[null,"Mittel 8"]
[null,"Preis",{"$f":"IF(C43=\"\",0,VLOOKUP(C43,PSMListe!Pflanzenschutz,2,FALSE))","v":0},{"$f":"IF(D43=\"\",0,VLOOKUP(D43,PSMListe!Pflanzenschutz,2,FALSE))","v":0},{"$f":"IF(E43=\"\",0,VLOOKUP(E43,PSMListe!Pflanzenschutz,2,FALSE))","v":0},{"$f":"IF(F43=\"\",0,VLOOKUP(F43,PSMListe!Pflanzenschutz,2,FALSE))","v":0},{"$f":"IF(G43=\"\",0,VLOOKUP(G43,PSMListe!Pflanzenschutz,2,FALSE))","v":0},{"$f":"IF(H43=\"\",0,VLOOKUP(H43,PSMListe!Pflanzenschutz,2,FALSE))","v":0},{"$f":"IF(I43=\"\",0,VLOOKUP(I43,PSMListe!Pflanzenschutz,2,FALSE))","v":0},{"$f":"IF(J43=\"\",0,VLOOKUP(J43,PSMListe!Pflanzenschutz,2,FALSE))","v":0},{"$f":"IF(K43=\"\",0,VLOOKUP(K43,PSMListe!Pflanzenschutz,2,FALSE))","v":0},{"$f":"IF(L43=\"\",0,VLOOKUP(L43,PSMListe!Pflanzenschutz,2,FALSE))","v":0},{"$f":"IF(M43=\"\",0,VLOOKUP(M43,PSMListe!Pflanzenschutz,2,FALSE))","v":0},{"$f":"IF(N43=\"\",0,VLOOKUP(N43,PSMListe!Pflanzenschutz,2,FALSE))","v":0},{"$f":"IF(O43=\"\",0,VLOOKUP(O43,PSMListe!Pflanzenschutz,2,FALSE))","v":0},{"$f":"IF(P43=\"\",0,VLOOKUP(P43,PSMListe!Pflanzenschutz,2,FALSE))","v":0},{"$f":"IF(Q43=\"\",0,VLOOKUP(Q43,PSMListe!Pflanzenschutz,2,FALSE))","v":0},{"$f":"IF(R43=\"\",0,VLOOKUP(R43,PSMListe!Pflanzenschutz,2,FALSE))","v":0},{"$f":"IF(S43=\"\",0,VLOOKUP(S43,PSMListe!Pflanzenschutz,2,FALSE))","v":0},{"$f":"IF(T43=\"\",0,VLOOKUP(T43,PSMListe!Pflanzenschutz,2,FALSE))","v":0},{"$f":"IF(U43=\"\",0,VLOOKUP(U43,PSMListe!Pflanzenschutz,2,FALSE))","v":0},{"$f":"IF(V43=\"\",0,VLOOKUP(V43,PSMListe!Pflanzenschutz,2,FALSE))","v":0},{"$f":"IF(W43=\"\",0,VLOOKUP(W43,PSMListe!Pflanzenschutz,2,FALSE))","v":0},{"$f":"IF(X43=\"\",0,VLOOKUP(X43,PSMListe!Pflanzenschutz,2,FALSE))","v":0},{"$f":"IF(Y43=\"\",0,VLOOKUP(Y43,PSMListe!Pflanzenschutz,2,FALSE))","v":0},{"$f":"IF(Z43=\"\",0,VLOOKUP(Z43,PSMListe!Pflanzenschutz,2,FALSE))","v":0},{"$f":"IF(AA43=\"\",0,VLOOKUP(AA43,PSMListe!Pflanzenschutz,2,FALSE))","v":0},{"$f":"IF(AB43=\"\",0,VLOOKUP(AB43,PSMListe!Pflanzenschutz,2,FALSE))","v":0},{"$f":"IF(AC43=\"\",0,VLOOKUP(AC43,PSMListe!Pflanzenschutz,2,FALSE))","v":0},{"$f":"IF(AD43=\"\",0,VLOOKUP(AD43,PSMListe!Pflanzenschutz,2,FALSE))","v":0},{"$f":"IF(AE43=\"\",0,VLOOKUP(AE43,PSMListe!Pflanzenschutz,2,FALSE))","v":0},{"$f":"IF(AF43=\"\",0,VLOOKUP(AF43,PSMListe!Pflanzenschutz,2,FALSE))","v":0},{"$f":"IF(AG43=\"\",0,VLOOKUP(AG43,PSMListe!Pflanzenschutz,2,FALSE))","v":0},{"$f":"IF(AH43=\"\",0,VLOOKUP(AH43,PSMListe!Pflanzenschutz,2,FALSE))","v":0},{"$f":"IF(AI43=\"\",0,VLOOKUP(AI43,PSMListe!Pflanzenschutz,2,FALSE))","v":0},{"$f":"IF(AJ43=\"\",0,VLOOKUP(AJ43,PSMListe!Pflanzenschutz,2,FALSE))","v":0},{"$f":"IF(AK43=\"\",0,VLOOKUP(AK43,PSMListe!Pflanzenschutz,2,FALSE))","v":0},{"$f":"IF(AL43=\"\",0,VLOOKUP(AL43,PSMListe!Pflanzenschutz,2,FALSE))","v":0},{"$f":"IF(AM43=\"\",0,VLOOKUP(AM43,PSMListe!Pflanzenschutz,2,FALSE))","v":0},{"$f":"IF(AN43=\"\",0,VLOOKUP(AN43,PSMListe!Pflanzenschutz,2,FALSE))","v":0},{"$f":"IF(AO43=\"\",0,VLOOKUP(AO43,PSMListe!Pflanzenschutz,2,FALSE))","v":0},{"$f":"IF(AP43=\"\",0,VLOOKUP(AP43,PSMListe!Pflanzenschutz,2,FALSE))","v":0},{"$f":"IF(AQ43=\"\",0,VLOOKUP(AQ43,PSMListe!Pflanzenschutz,2,FALSE))","v":0},{"$f":"IF(AR43=\"\",0,VLOOKUP(AR43,PSMListe!Pflanzenschutz,2,FALSE))","v":0},{"$f":"IF(AS43=\"\",0,VLOOKUP(AS43,PSMListe!Pflanzenschutz,2,FALSE))","v":0},{"$f":"IF(AT43=\"\",0,VLOOKUP(AT43,PSMListe!Pflanzenschutz,2,FALSE))","v":0},{"$f":"IF(AU43=\"\",0,VLOOKUP(AU43,PSMListe!Pflanzenschutz,2,FALSE))","v":0},{"$f":"IF(AV43=\"\",0,VLOOKUP(AV43,PSMListe!Pflanzenschutz,2,FALSE))","v":0},{"$f":"IF(AW43=\"\",0,VLOOKUP(AW43,PSMListe!Pflanzenschutz,2,FALSE))","v":0},{"$f":"IF(AX43=\"\",0,VLOOKUP(AX43,PSMListe!Pflanzenschutz,2,FALSE))","v":0},{"$f":"IF(AY43=\"\",0,VLOOKUP(AY43,PSMListe!Pflanzenschutz,2,FALSE))","v":0},{"$f":"IF(AZ43=\"\",0,VLOOKUP(AZ43,PSMListe!Pflanzenschutz,2,FALSE))","v":0},{"$f":"IF(BA43=\"\",0,VLOOKUP(BA43,PSMListe!Pflanzenschutz,2,FALSE))","v":0},{"$f":"IF(BB43=\"\",0,VLOOKUP(BB43,PSMListe!Pflanzenschutz,2,FALSE))","v":0},{"$f":"IF(BC43=\"\",0,VLOOKUP(BC43,PSMListe!Pflanzenschutz,2,FALSE))","v":0},{"$f":"IF(BD43=\"\",0,VLOOKUP(BD43,PSMListe!Pflanzenschutz,2,FALSE))","v":0},{"$f":"IF(BE43=\"\",0,VLOOKUP(BE43,PSMListe!Pflanzenschutz,2,FALSE))","v":0},{"$f":"IF(BF43=\"\",0,VLOOKUP(BF43,PSMListe!Pflanzenschutz,2,FALSE))","v":0},{"$f":"IF(BG43=\"\",0,VLOOKUP(BG43,PSMListe!Pflanzenschutz,2,FALSE))","v":0},{"$f":"IF(BH43=\"\",0,VLOOKUP(BH43,PSMListe!Pflanzenschutz,2,FALSE))","v":0},{"$f":"IF(BI43=\"\",0,VLOOKUP(BI43,PSMListe!Pflanzenschutz,2,FALSE))","v":0},{"$f":"IF(BJ43=\"\",0,VLOOKUP(BJ43,PSMListe!Pflanzenschutz,2,FALSE))","v":0}]
[null,"Menge"]
[null,"Bemerkung"]
[null,"Datum"]
[null,"Mittel 9"]
[null,"Preis",{"$f":"IF(C48=\"\",0,VLOOKUP(C48,PSMListe!Pflanzenschutz,2,FALSE))","v":0},{"$f":"IF(D48=\"\",0,VLOOKUP(D48,PSMListe!Pflanzenschutz,2,FALSE))","v":0},{"$f":"IF(E48=\"\",0,VLOOKUP(E48,PSMListe!Pflanzenschutz,2,FALSE))","v":0},{"$f":"IF(F48=\"\",0,VLOOKUP(F48,PSMListe!Pflanzenschutz,2,FALSE))","v":0},{"$f":"IF(G48=\"\",0,VLOOKUP(G48,PSMListe!Pflanzenschutz,2,FALSE))","v":0},{"$f":"IF(H48=\"\",0,VLOOKUP(H48,PSMListe!Pflanzenschutz,2,FALSE))","v":0},{"$f":"IF(I48=\"\",0,VLOOKUP(I48,PSMListe!Pflanzenschutz,2,FALSE))","v":0},{"$f":"IF(J48=\"\",0,VLOOKUP(J48,PSMListe!Pflanzenschutz,2,FALSE))","v":0},{"$f":"IF(K48=\"\",0,VLOOKUP(K48,PSMListe!Pflanzenschutz,2,FALSE))","v":0},{"$f":"IF(L48=\"\",0,VLOOKUP(L48,PSMListe!Pflanzenschutz,2,FALSE))","v":0},{"$f":"IF(M48=\"\",0,VLOOKUP(M48,PSMListe!Pflanzenschutz,2,FALSE))","v":0},{"$f":"IF(N48=\"\",0,VLOOKUP(N48,PSMListe!Pflanzenschutz,2,FALSE))","v":0},{"$f":"IF(O48=\"\",0,VLOOKUP(O48,PSMListe!Pflanzenschutz,2,FALSE))","v":0},{"$f":"IF(P48=\"\",0,VLOOKUP(P48,PSMListe!Pflanzenschutz,2,FALSE))","v":0},{"$f":"IF(Q48=\"\",0,VLOOKUP(Q48,PSMListe!Pflanzenschutz,2,FALSE))","v":0},{"$f":"IF(R48=\"\",0,VLOOKUP(R48,PSMListe!Pflanzenschutz,2,FALSE))","v":0},{"$f":"IF(S48=\"\",0,VLOOKUP(S48,PSMListe!Pflanzenschutz,2,FALSE))","v":0},{"$f":"IF(T48=\"\",0,VLOOKUP(T48,PSMListe!Pflanzenschutz,2,FALSE))","v":0},{"$f":"IF(U48=\"\",0,VLOOKUP(U48,PSMListe!Pflanzenschutz,2,FALSE))","v":0},{"$f":"IF(V48=\"\",0,VLOOKUP(V48,PSMListe!Pflanzenschutz,2,FALSE))","v":0},{"$f":"IF(W48=\"\",0,VLOOKUP(W48,PSMListe!Pflanzenschutz,2,FALSE))","v":0},{"$f":"IF(X48=\"\",0,VLOOKUP(X48,PSMListe!Pflanzenschutz,2,FALSE))","v":0},{"$f":"IF(Y48=\"\",0,VLOOKUP(Y48,PSMListe!Pflanzenschutz,2,FALSE))","v":0},{"$f":"IF(Z48=\"\",0,VLOOKUP(Z48,PSMListe!Pflanzenschutz,2,FALSE))","v":0},{"$f":"IF(AA48=\"\",0,VLOOKUP(AA48,PSMListe!Pflanzenschutz,2,FALSE))","v":0},{"$f":"IF(AB48=\"\",0,VLOOKUP(AB48,PSMListe!Pflanzenschutz,2,FALSE))","v":0},{"$f":"IF(AC48=\"\",0,VLOOKUP(AC48,PSMListe!Pflanzenschutz,2,FALSE))","v":0},{"$f":"IF(AD48=\"\",0,VLOOKUP(AD48,PSMListe!Pflanzenschutz,2,FALSE))","v":0},{"$f":"IF(AE48=\"\",0,VLOOKUP(AE48,PSMListe!Pflanzenschutz,2,FALSE))","v":0},{"$f":"IF(AF48=\"\",0,VLOOKUP(AF48,PSMListe!Pflanzenschutz,2,FALSE))","v":0},{"$f":"IF(AG48=\"\",0,VLOOKUP(AG48,PSMListe!Pflanzenschutz,2,FALSE))","v":0},{"$f":"IF(AH48=\"\",0,VLOOKUP(AH48,PSMListe!Pflanzenschutz,2,FALSE))","v":0},{"$f":"IF(AI48=\"\",0,VLOOKUP(AI48,PSMListe!Pflanzenschutz,2,FALSE))","v":0},{"$f":"IF(AJ48=\"\",0,VLOOKUP(AJ48,PSMListe!Pflanzenschutz,2,FALSE))","v":0},{"$f":"IF(AK48=\"\",0,VLOOKUP(AK48,PSMListe!Pflanzenschutz,2,FALSE))","v":0},{"$f":"IF(AL48=\"\",0,VLOOKUP(AL48,PSMListe!Pflanzenschutz,2,FALSE))","v":0},{"$f":"IF(AM48=\"\",0,VLOOKUP(AM48,PSMListe!Pflanzenschutz,2,FALSE))","v":0},{"$f":"IF(AN48=\"\",0,VLOOKUP(AN48,PSMListe!Pflanzenschutz,2,FALSE))","v":0},{"$f":"IF(AO48=\"\",0,VLOOKUP(AO48,PSMListe!Pflanzenschutz,2,FALSE))","v":0},{"$f":"IF(AP48=\"\",0,VLOOKUP(AP48,PSMListe!Pflanzenschutz,2,FALSE))","v":0},{"$f":"IF(AQ48=\"\",0,VLOOKUP(AQ48,PSMListe!Pflanzenschutz,2,FALSE))","v":0},{"$f":"IF(AR48=\"\",0,VLOOKUP(AR48,PSMListe!Pflanzenschutz,2,FALSE))","v":0},{"$f":"IF(AS48=\"\",0,VLOOKUP(AS48,PSMListe!Pflanzenschutz,2,FALSE))","v":0},{"$f":"IF(AT48=\"\",0,VLOOKUP(AT48,PSMListe!Pflanzenschutz,2,FALSE))","v":0},{"$f":"IF(AU48=\"\",0,VLOOKUP(AU48,PSMListe!Pflanzenschutz,2,FALSE))","v":0},{"$f":"IF(AV48=\"\",0,VLOOKUP(AV48,PSMListe!Pflanzenschutz,2,FALSE))","v":0},{"$f":"IF(AW48=\"\",0,VLOOKUP(AW48,PSMListe!Pflanzenschutz,2,FALSE))","v":0},{"$f":"IF(AX48=\"\",0,VLOOKUP(AX48,PSMListe!Pflanzenschutz,2,FALSE))","v":0},{"$f":"IF(AY48=\"\",0,VLOOKUP(AY48,PSMListe!Pflanzenschutz,2,FALSE))","v":0},{"$f":"IF(AZ48=\"\",0,VLOOKUP(AZ48,PSMListe!Pflanzenschutz,2,FALSE))","v":0},{"$f":"IF(BA48=\"\",0,VLOOKUP(BA48,PSMListe!Pflanzenschutz,2,FALSE))","v":0},{"$f":"IF(BB48=\"\",0,VLOOKUP(BB48,PSMListe!Pflanzenschutz,2,FALSE))","v":0},{"$f":"IF(BC48=\"\",0,VLOOKUP(BC48,PSMListe!Pflanzenschutz,2,FALSE))","v":0},{"$f":"IF(BD48=\"\",0,VLOOKUP(BD48,PSMListe!Pflanzenschutz,2,FALSE))","v":0},{"$f":"IF(BE48=\"\",0,VLOOKUP(BE48,PSMListe!Pflanzenschutz,2,FALSE))","v":0},{"$f":"IF(BF48=\"\",0,VLOOKUP(BF48,PSMListe!Pflanzenschutz,2,FALSE))","v":0},{"$f":"IF(BG48=\"\",0,VLOOKUP(BG48,PSMListe!Pflanzenschutz,2,FALSE))","v":0},{"$f":"IF(BH48=\"\",0,VLOOKUP(BH48,PSMListe!Pflanzenschutz,2,FALSE))","v":0},{"$f":"IF(BI48=\"\",0,VLOOKUP(BI48,PSMListe!Pflanzenschutz,2,FALSE))","v":0},{"$f":"IF(BJ48=\"\",0,VLOOKUP(BJ48,PSMListe!Pflanzenschutz,2,FALSE))","v":0}]
[null,"Menge"]
[null,"Bemerkung"]
[null,"Datum"]
[null,"Mittel 10"]
[null,"Preis",{"$f":"IF(C53=\"\",0,VLOOKUP(C53,PSMListe!Pflanzenschutz,2,FALSE))","v":0},{"$f":"IF(D53=\"\",0,VLOOKUP(D53,PSMListe!Pflanzenschutz,2,FALSE))","v":0},{"$f":"IF(E53=\"\",0,VLOOKUP(E53,PSMListe!Pflanzenschutz,2,FALSE))","v":0},{"$f":"IF(F53=\"\",0,VLOOKUP(F53,PSMListe!Pflanzenschutz,2,FALSE))","v":0},{"$f":"IF(G53=\"\",0,VLOOKUP(G53,PSMListe!Pflanzenschutz,2,FALSE))","v":0},{"$f":"IF(H53=\"\",0,VLOOKUP(H53,PSMListe!Pflanzenschutz,2,FALSE))","v":0},{"$f":"IF(I53=\"\",0,VLOOKUP(I53,PSMListe!Pflanzenschutz,2,FALSE))","v":0},{"$f":"IF(J53=\"\",0,VLOOKUP(J53,PSMListe!Pflanzenschutz,2,FALSE))","v":0},{"$f":"IF(K53=\"\",0,VLOOKUP(K53,PSMListe!Pflanzenschutz,2,FALSE))","v":0},{"$f":"IF(L53=\"\",0,VLOOKUP(L53,PSMListe!Pflanzenschutz,2,FALSE))","v":0},{"$f":"IF(M53=\"\",0,VLOOKUP(M53,PSMListe!Pflanzenschutz,2,FALSE))","v":0},{"$f":"IF(N53=\"\",0,VLOOKUP(N53,PSMListe!Pflanzenschutz,2,FALSE))","v":0},{"$f":"IF(O53=\"\",0,VLOOKUP(O53,PSMListe!Pflanzenschutz,2,FALSE))","v":0},{"$f":"IF(P53=\"\",0,VLOOKUP(P53,PSMListe!Pflanzenschutz,2,FALSE))","v":0},{"$f":"IF(Q53=\"\",0,VLOOKUP(Q53,PSMListe!Pflanzenschutz,2,FALSE))","v":0},{"$f":"IF(R53=\"\",0,VLOOKUP(R53,PSMListe!Pflanzenschutz,2,FALSE))","v":0},{"$f":"IF(S53=\"\",0,VLOOKUP(S53,PSMListe!Pflanzenschutz,2,FALSE))","v":0},{"$f":"IF(T53=\"\",0,VLOOKUP(T53,PSMListe!Pflanzenschutz,2,FALSE))","v":0},{"$f":"IF(U53=\"\",0,VLOOKUP(U53,PSMListe!Pflanzenschutz,2,FALSE))","v":0},{"$f":"IF(V53=\"\",0,VLOOKUP(V53,PSMListe!Pflanzenschutz,2,FALSE))","v":0},{"$f":"IF(W53=\"\",0,VLOOKUP(W53,PSMListe!Pflanzenschutz,2,FALSE))","v":0},{"$f":"IF(X53=\"\",0,VLOOKUP(X53,PSMListe!Pflanzenschutz,2,FALSE))","v":0},{"$f":"IF(Y53=\"\",0,VLOOKUP(Y53,PSMListe!Pflanzenschutz,2,FALSE))","v":0},{"$f":"IF(Z53=\"\",0,VLOOKUP(Z53,PSMListe!Pflanzenschutz,2,FALSE))","v":0},{"$f":"IF(AA53=\"\",0,VLOOKUP(AA53,PSMListe!Pflanzenschutz,2,FALSE))","v":0},{"$f":"IF(AB53=\"\",0,VLOOKUP(AB53,PSMListe!Pflanzenschutz,2,FALSE))","v":0},{"$f":"IF(AC53=\"\",0,VLOOKUP(AC53,PSMListe!Pflanzenschutz,2,FALSE))","v":0},{"$f":"IF(AD53=\"\",0,VLOOKUP(AD53,PSMListe!Pflanzenschutz,2,FALSE))","v":0},{"$f":"IF(AE53=\"\",0,VLOOKUP(AE53,PSMListe!Pflanzenschutz,2,FALSE))","v":0},{"$f":"IF(AF53=\"\",0,VLOOKUP(AF53,PSMListe!Pflanzenschutz,2,FALSE))","v":0},{"$f":"IF(AG53=\"\",0,VLOOKUP(AG53,PSMListe!Pflanzenschutz,2,FALSE))","v":0},{"$f":"IF(AH53=\"\",0,VLOOKUP(AH53,PSMListe!Pflanzenschutz,2,FALSE))","v":0},{"$f":"IF(AI53=\"\",0,VLOOKUP(AI53,PSMListe!Pflanzenschutz,2,FALSE))","v":0},{"$f":"IF(AJ53=\"\",0,VLOOKUP(AJ53,PSMListe!Pflanzenschutz,2,FALSE))","v":0},{"$f":"IF(AK53=\"\",0,VLOOKUP(AK53,PSMListe!Pflanzenschutz,2,FALSE))","v":0},{"$f":"IF(AL53=\"\",0,VLOOKUP(AL53,PSMListe!Pflanzenschutz,2,FALSE))","v":0},{"$f":"IF(AM53=\"\",0,VLOOKUP(AM53,PSMListe!Pflanzenschutz,2,FALSE))","v":0},{"$f":"IF(AN53=\"\",0,VLOOKUP(AN53,PSMListe!Pflanzenschutz,2,FALSE))","v":0},{"$f":"IF(AO53=\"\",0,VLOOKUP(AO53,PSMListe!Pflanzenschutz,2,FALSE))","v":0},{"$f":"IF(AP53=\"\",0,VLOOKUP(AP53,PSMListe!Pflanzenschutz,2,FALSE))","v":0},{"$f":"IF(AQ53=\"\",0,VLOOKUP(AQ53,PSMListe!Pflanzenschutz,2,FALSE))","v":0},{"$f":"IF(AR53=\"\",0,VLOOKUP(AR53,PSMListe!Pflanzenschutz,2,FALSE))","v":0},{"$f":"IF(AS53=\"\",0,VLOOKUP(AS53,PSMListe!Pflanzenschutz,2,FALSE))","v":0},{"$f":"IF(AT53=\"\",0,VLOOKUP(AT53,PSMListe!Pflanzenschutz,2,FALSE))","v":0},{"$f":"IF(AU53=\"\",0,VLOOKUP(AU53,PSMListe!Pflanzenschutz,2,FALSE))","v":0},{"$f":"IF(AV53=\"\",0,VLOOKUP(AV53,PSMListe!Pflanzenschutz,2,FALSE))","v":0},{"$f":"IF(AW53=\"\",0,VLOOKUP(AW53,PSMListe!Pflanzenschutz,2,FALSE))","v":0},{"$f":"IF(AX53=\"\",0,VLOOKUP(AX53,PSMListe!Pflanzenschutz,2,FALSE))","v":0},{"$f":"IF(AY53=\"\",0,VLOOKUP(AY53,PSMListe!Pflanzenschutz,2,FALSE))","v":0},{"$f":"IF(AZ53=\"\",0,VLOOKUP(AZ53,PSMListe!Pflanzenschutz,2,FALSE))","v":0},{"$f":"IF(BA53=\"\",0,VLOOKUP(BA53,PSMListe!Pflanzenschutz,2,FALSE))","v":0},{"$f":"IF(BB53=\"\",0,VLOOKUP(BB53,PSMListe!Pflanzenschutz,2,FALSE))","v":0},{"$f":"IF(BC53=\"\",0,VLOOKUP(BC53,PSMListe!Pflanzenschutz,2,FALSE))","v":0},{"$f":"IF(BD53=\"\",0,VLOOKUP(BD53,PSMListe!Pflanzenschutz,2,FALSE))","v":0},{"$f":"IF(BE53=\"\",0,VLOOKUP(BE53,PSMListe!Pflanzenschutz,2,FALSE))","v":0},{"$f":"IF(BF53=\"\",0,VLOOKUP(BF53,PSMListe!Pflanzenschutz,2,FALSE))","v":0},{"$f":"IF(BG53=\"\",0,VLOOKUP(BG53,PSMListe!Pflanzenschutz,2,FALSE))","v":0},{"$f":"IF(BH53=\"\",0,VLOOKUP(BH53,PSMListe!Pflanzenschutz,2,FALSE))","v":0},{"$f":"IF(BI53=\"\",0,VLOOKUP(BI53,PSMListe!Pflanzenschutz,2,FALSE))","v":0},{"$f":"IF(BJ53=\"\",0,VLOOKUP(BJ53,PSMListe!Pflanzenschutz,2,FALSE))","v":0}]
[null,"Menge"]
[null,"Bemerkung"]
[null,"Datum"]
[null,"Mittel 11"]
[null,"Preis",{"$f":"IF(C58=\"\",0,VLOOKUP(C58,PSMListe!Pflanzenschutz,2,FALSE))","v":0},{"$f":"IF(D58=\"\",0,VLOOKUP(D58,PSMListe!Pflanzenschutz,2,FALSE))","v":0},{"$f":"IF(E58=\"\",0,VLOOKUP(E58,PSMListe!Pflanzenschutz,2,FALSE))","v":0},{"$f":"IF(F58=\"\",0,VLOOKUP(F58,PSMListe!Pflanzenschutz,2,FALSE))","v":0},{"$f":"IF(G58=\"\",0,VLOOKUP(G58,PSMListe!Pflanzenschutz,2,FALSE))","v":0},{"$f":"IF(H58=\"\",0,VLOOKUP(H58,PSMListe!Pflanzenschutz,2,FALSE))","v":0},{"$f":"IF(I58=\"\",0,VLOOKUP(I58,PSMListe!Pflanzenschutz,2,FALSE))","v":0},{"$f":"IF(J58=\"\",0,VLOOKUP(J58,PSMListe!Pflanzenschutz,2,FALSE))","v":0},{"$f":"IF(K58=\"\",0,VLOOKUP(K58,PSMListe!Pflanzenschutz,2,FALSE))","v":0},{"$f":"IF(L58=\"\",0,VLOOKUP(L58,PSMListe!Pflanzenschutz,2,FALSE))","v":0},{"$f":"IF(M58=\"\",0,VLOOKUP(M58,PSMListe!Pflanzenschutz,2,FALSE))","v":0},{"$f":"IF(N58=\"\",0,VLOOKUP(N58,PSMListe!Pflanzenschutz,2,FALSE))","v":0},{"$f":"IF(O58=\"\",0,VLOOKUP(O58,PSMListe!Pflanzenschutz,2,FALSE))","v":0},{"$f":"IF(P58=\"\",0,VLOOKUP(P58,PSMListe!Pflanzenschutz,2,FALSE))","v":0},{"$f":"IF(Q58=\"\",0,VLOOKUP(Q58,PSMListe!Pflanzenschutz,2,FALSE))","v":0},{"$f":"IF(R58=\"\",0,VLOOKUP(R58,PSMListe!Pflanzenschutz,2,FALSE))","v":0},{"$f":"IF(S58=\"\",0,VLOOKUP(S58,PSMListe!Pflanzenschutz,2,FALSE))","v":0},{"$f":"IF(T58=\"\",0,VLOOKUP(T58,PSMListe!Pflanzenschutz,2,FALSE))","v":0},{"$f":"IF(U58=\"\",0,VLOOKUP(U58,PSMListe!Pflanzenschutz,2,FALSE))","v":0},{"$f":"IF(V58=\"\",0,VLOOKUP(V58,PSMListe!Pflanzenschutz,2,FALSE))","v":0},{"$f":"IF(W58=\"\",0,VLOOKUP(W58,PSMListe!Pflanzenschutz,2,FALSE))","v":0},{"$f":"IF(X58=\"\",0,VLOOKUP(X58,PSMListe!Pflanzenschutz,2,FALSE))","v":0},{"$f":"IF(Y58=\"\",0,VLOOKUP(Y58,PSMListe!Pflanzenschutz,2,FALSE))","v":0},{"$f":"IF(Z58=\"\",0,VLOOKUP(Z58,PSMListe!Pflanzenschutz,2,FALSE))","v":0},{"$f":"IF(AA58=\"\",0,VLOOKUP(AA58,PSMListe!Pflanzenschutz,2,FALSE))","v":0},{"$f":"IF(AB58=\"\",0,VLOOKUP(AB58,PSMListe!Pflanzenschutz,2,FALSE))","v":0},{"$f":"IF(AC58=\"\",0,VLOOKUP(AC58,PSMListe!Pflanzenschutz,2,FALSE))","v":0},{"$f":"IF(AD58=\"\",0,VLOOKUP(AD58,PSMListe!Pflanzenschutz,2,FALSE))","v":0},{"$f":"IF(AE58=\"\",0,VLOOKUP(AE58,PSMListe!Pflanzenschutz,2,FALSE))","v":0},{"$f":"IF(AF58=\"\",0,VLOOKUP(AF58,PSMListe!Pflanzenschutz,2,FALSE))","v":0},{"$f":"IF(AG58=\"\",0,VLOOKUP(AG58,PSMListe!Pflanzenschutz,2,FALSE))","v":0},{"$f":"IF(AH58=\"\",0,VLOOKUP(AH58,PSMListe!Pflanzenschutz,2,FALSE))","v":0},{"$f":"IF(AI58=\"\",0,VLOOKUP(AI58,PSMListe!Pflanzenschutz,2,FALSE))","v":0},{"$f":"IF(AJ58=\"\",0,VLOOKUP(AJ58,PSMListe!Pflanzenschutz,2,FALSE))","v":0},{"$f":"IF(AK58=\"\",0,VLOOKUP(AK58,PSMListe!Pflanzenschutz,2,FALSE))","v":0},{"$f":"IF(AL58=\"\",0,VLOOKUP(AL58,PSMListe!Pflanzenschutz,2,FALSE))","v":0},{"$f":"IF(AM58=\"\",0,VLOOKUP(AM58,PSMListe!Pflanzenschutz,2,FALSE))","v":0},{"$f":"IF(AN58=\"\",0,VLOOKUP(AN58,PSMListe!Pflanzenschutz,2,FALSE))","v":0},{"$f":"IF(AO58=\"\",0,VLOOKUP(AO58,PSMListe!Pflanzenschutz,2,FALSE))","v":0},{"$f":"IF(AP58=\"\",0,VLOOKUP(AP58,PSMListe!Pflanzenschutz,2,FALSE))","v":0},{"$f":"IF(AQ58=\"\",0,VLOOKUP(AQ58,PSMListe!Pflanzenschutz,2,FALSE))","v":0},{"$f":"IF(AR58=\"\",0,VLOOKUP(AR58,PSMListe!Pflanzenschutz,2,FALSE))","v":0},{"$f":"IF(AS58=\"\",0,VLOOKUP(AS58,PSMListe!Pflanzenschutz,2,FALSE))","v":0},{"$f":"IF(AT58=\"\",0,VLOOKUP(AT58,PSMListe!Pflanzenschutz,2,FALSE))","v":0},{"$f":"IF(AU58=\"\",0,VLOOKUP(AU58,PSMListe!Pflanzenschutz,2,FALSE))","v":0},{"$f":"IF(AV58=\"\",0,VLOOKUP(AV58,PSMListe!Pflanzenschutz,2,FALSE))","v":0},{"$f":"IF(AW58=\"\",0,VLOOKUP(AW58,PSMListe!Pflanzenschutz,2,FALSE))","v":0},{"$f":"IF(AX58=\"\",0,VLOOKUP(AX58,PSMListe!Pflanzenschutz,2,FALSE))","v":0},{"$f":"IF(AY58=\"\",0,VLOOKUP(AY58,PSMListe!Pflanzenschutz,2,FALSE))","v":0},{"$f":"IF(AZ58=\"\",0,VLOOKUP(AZ58,PSMListe!Pflanzenschutz,2,FALSE))","v":0},{"$f":"IF(BA58=\"\",0,VLOOKUP(BA58,PSMListe!Pflanzenschutz,2,FALSE))","v":0},{"$f":"IF(BB58=\"\",0,VLOOKUP(BB58,PSMListe!Pflanzenschutz,2,FALSE))","v":0},{"$f":"IF(BC58=\"\",0,VLOOKUP(BC58,PSMListe!Pflanzenschutz,2,FALSE))","v":0},{"$f":"IF(BD58=\"\",0,VLOOKUP(BD58,PSMListe!Pflanzenschutz,2,FALSE))","v":0},{"$f":"IF(BE58=\"\",0,VLOOKUP(BE58,PSMListe!Pflanzenschutz,2,FALSE))","v":0},{"$f":"IF(BF58=\"\",0,VLOOKUP(BF58,PSMListe!Pflanzenschutz,2,FALSE))","v":0},{"$f":"IF(BG58=\"\",0,VLOOKUP(BG58,PSMListe!Pflanzenschutz,2,FALSE))","v":0},{"$f":"IF(BH58=\"\",0,VLOOKUP(BH58,PSMListe!Pflanzenschutz,2,FALSE))","v":0},{"$f":"IF(BI58=\"\",0,VLOOKUP(BI58,PSMListe!Pflanzenschutz,2,FALSE))","v":0},{"$f":"IF(BJ58=\"\",0,VLOOKUP(BJ58,PSMListe!Pflanzenschutz,2,FALSE))","v":0}]
[null,"Menge"]
[null,"Bemerkung"]
[null,"Datum"]
[null,"Mittel 12"]
[null,"Preis",{"$f":"IF(C63=\"\",0,VLOOKUP(C63,PSMListe!Pflanzenschutz,2,FALSE))","v":0},{"$f":"IF(D63=\"\",0,VLOOKUP(D63,PSMListe!Pflanzenschutz,2,FALSE))","v":0},{"$f":"IF(E63=\"\",0,VLOOKUP(E63,PSMListe!Pflanzenschutz,2,FALSE))","v":0},{"$f":"IF(F63=\"\",0,VLOOKUP(F63,PSMListe!Pflanzenschutz,2,FALSE))","v":0},{"$f":"IF(G63=\"\",0,VLOOKUP(G63,PSMListe!Pflanzenschutz,2,FALSE))","v":0},{"$f":"IF(H63=\"\",0,VLOOKUP(H63,PSMListe!Pflanzenschutz,2,FALSE))","v":0},{"$f":"IF(I63=\"\",0,VLOOKUP(I63,PSMListe!Pflanzenschutz,2,FALSE))","v":0},{"$f":"IF(J63=\"\",0,VLOOKUP(J63,PSMListe!Pflanzenschutz,2,FALSE))","v":0},{"$f":"IF(K63=\"\",0,VLOOKUP(K63,PSMListe!Pflanzenschutz,2,FALSE))","v":0},{"$f":"IF(L63=\"\",0,VLOOKUP(L63,PSMListe!Pflanzenschutz,2,FALSE))","v":0},{"$f":"IF(M63=\"\",0,VLOOKUP(M63,PSMListe!Pflanzenschutz,2,FALSE))","v":0},{"$f":"IF(N63=\"\",0,VLOOKUP(N63,PSMListe!Pflanzenschutz,2,FALSE))","v":0},{"$f":"IF(O63=\"\",0,VLOOKUP(O63,PSMListe!Pflanzenschutz,2,FALSE))","v":0},{"$f":"IF(P63=\"\",0,VLOOKUP(P63,PSMListe!Pflanzenschutz,2,FALSE))","v":0},{"$f":"IF(Q63=\"\",0,VLOOKUP(Q63,PSMListe!Pflanzenschutz,2,FALSE))","v":0},{"$f":"IF(R63=\"\",0,VLOOKUP(R63,PSMListe!Pflanzenschutz,2,FALSE))","v":0},{"$f":"IF(S63=\"\",0,VLOOKUP(S63,PSMListe!Pflanzenschutz,2,FALSE))","v":0},{"$f":"IF(T63=\"\",0,VLOOKUP(T63,PSMListe!Pflanzenschutz,2,FALSE))","v":0},{"$f":"IF(U63=\"\",0,VLOOKUP(U63,PSMListe!Pflanzenschutz,2,FALSE))","v":0},{"$f":"IF(V63=\"\",0,VLOOKUP(V63,PSMListe!Pflanzenschutz,2,FALSE))","v":0},{"$f":"IF(W63=\"\",0,VLOOKUP(W63,PSMListe!Pflanzenschutz,2,FALSE))","v":0},{"$f":"IF(X63=\"\",0,VLOOKUP(X63,PSMListe!Pflanzenschutz,2,FALSE))","v":0},{"$f":"IF(Y63=\"\",0,VLOOKUP(Y63,PSMListe!Pflanzenschutz,2,FALSE))","v":0},{"$f":"IF(Z63=\"\",0,VLOOKUP(Z63,PSMListe!Pflanzenschutz,2,FALSE))","v":0},{"$f":"IF(AA63=\"\",0,VLOOKUP(AA63,PSMListe!Pflanzenschutz,2,FALSE))","v":0},{"$f":"IF(AB63=\"\",0,VLOOKUP(AB63,PSMListe!Pflanzenschutz,2,FALSE))","v":0},{"$f":"IF(AC63=\"\",0,VLOOKUP(AC63,PSMListe!Pflanzenschutz,2,FALSE))","v":0},{"$f":"IF(AD63=\"\",0,VLOOKUP(AD63,PSMListe!Pflanzenschutz,2,FALSE))","v":0},{"$f":"IF(AE63=\"\",0,VLOOKUP(AE63,PSMListe!Pflanzenschutz,2,FALSE))","v":0},{"$f":"IF(AF63=\"\",0,VLOOKUP(AF63,PSMListe!Pflanzenschutz,2,FALSE))","v":0},{"$f":"IF(AG63=\"\",0,VLOOKUP(AG63,PSMListe!Pflanzenschutz,2,FALSE))","v":0},{"$f":"IF(AH63=\"\",0,VLOOKUP(AH63,PSMListe!Pflanzenschutz,2,FALSE))","v":0},{"$f":"IF(AI63=\"\",0,VLOOKUP(AI63,PSMListe!Pflanzenschutz,2,FALSE))","v":0},{"$f":"IF(AJ63=\"\",0,VLOOKUP(AJ63,PSMListe!Pflanzenschutz,2,FALSE))","v":0},{"$f":"IF(AK63=\"\",0,VLOOKUP(AK63,PSMListe!Pflanzenschutz,2,FALSE))","v":0},{"$f":"IF(AL63=\"\",0,VLOOKUP(AL63,PSMListe!Pflanzenschutz,2,FALSE))","v":0},{"$f":"IF(AM63=\"\",0,VLOOKUP(AM63,PSMListe!Pflanzenschutz,2,FALSE))","v":0},{"$f":"IF(AN63=\"\",0,VLOOKUP(AN63,PSMListe!Pflanzenschutz,2,FALSE))","v":0},{"$f":"IF(AO63=\"\",0,VLOOKUP(AO63,PSMListe!Pflanzenschutz,2,FALSE))","v":0},{"$f":"IF(AP63=\"\",0,VLOOKUP(AP63,PSMListe!Pflanzenschutz,2,FALSE))","v":0},{"$f":"IF(AQ63=\"\",0,VLOOKUP(AQ63,PSMListe!Pflanzenschutz,2,FALSE))","v":0},{"$f":"IF(AR63=\"\",0,VLOOKUP(AR63,PSMListe!Pflanzenschutz,2,FALSE))","v":0},{"$f":"IF(AS63=\"\",0,VLOOKUP(AS63,PSMListe!Pflanzenschutz,2,FALSE))","v":0},{"$f":"IF(AT63=\"\",0,VLOOKUP(AT63,PSMListe!Pflanzenschutz,2,FALSE))","v":0},{"$f":"IF(AU63=\"\",0,VLOOKUP(AU63,PSMListe!Pflanzenschutz,2,FALSE))","v":0},{"$f":"IF(AV63=\"\",0,VLOOKUP(AV63,PSMListe!Pflanzenschutz,2,FALSE))","v":0},{"$f":"IF(AW63=\"\",0,VLOOKUP(AW63,PSMListe!Pflanzenschutz,2,FALSE))","v":0},{"$f":"IF(AX63=\"\",0,VLOOKUP(AX63,PSMListe!Pflanzenschutz,2,FALSE))","v":0},{"$f":"IF(AY63=\"\",0,VLOOKUP(AY63,PSMListe!Pflanzenschutz,2,FALSE))","v":0},{"$f":"IF(AZ63=\"\",0,VLOOKUP(AZ63,PSMListe!Pflanzenschutz,2,FALSE))","v":0},{"$f":"IF(BA63=\"\",0,VLOOKUP(BA63,PSMListe!Pflanzenschutz,2,FALSE))","v":0},{"$f":"IF(BB63=\"\",0,VLOOKUP(BB63,PSMListe!Pflanzenschutz,2,FALSE))","v":0},{"$f":"IF(BC63=\"\",0,VLOOKUP(BC63,PSMListe!Pflanzenschutz,2,FALSE))","v":0},{"$f":"IF(BD63=\"\",0,VLOOKUP(BD63,PSMListe!Pflanzenschutz,2,FALSE))","v":0},{"$f":"IF(BE63=\"\",0,VLOOKUP(BE63,PSMListe!Pflanzenschutz,2,FALSE))","v":0},{"$f":"IF(BF63=\"\",0,VLOOKUP(BF63,PSMListe!Pflanzenschutz,2,FALSE))","v":0},{"$f":"IF(BG63=\"\",0,VLOOKUP(BG63,PSMListe!Pflanzenschutz,2,FALSE))","v":0},{"$f":"IF(BH63=\"\",0,VLOOKUP(BH63,PSMListe!Pflanzenschutz,2,FALSE))","v":0},{"$f":"IF(BI63=\"\",0,VLOOKUP(BI63,PSMListe!Pflanzenschutz,2,FALSE))","v":0},{"$f":"IF(BJ63=\"\",0,VLOOKUP(BJ63,PSMListe!Pflanzenschutz,2,FALSE))","v":0}]
[null,"Menge"]
[null,"Bemerkung"]
[null,"Datum"]
[null,"Mittel 13"]
[null,"Preis",{"$f":"IF(C68=\"\",0,VLOOKUP(C68,PSMListe!Pflanzenschutz,2,FALSE))","v":0},{"$f":"IF(D68=\"\",0,VLOOKUP(D68,PSMListe!Pflanzenschutz,2,FALSE))","v":0},{"$f":"IF(E68=\"\",0,VLOOKUP(E68,PSMListe!Pflanzenschutz,2,FALSE))","v":0},{"$f":"IF(F68=\"\",0,VLOOKUP(F68,PSMListe!Pflanzenschutz,2,FALSE))","v":0},{"$f":"IF(G68=\"\",0,VLOOKUP(G68,PSMListe!Pflanzenschutz,2,FALSE))","v":0},{"$f":"IF(H68=\"\",0,VLOOKUP(H68,PSMListe!Pflanzenschutz,2,FALSE))","v":0},{"$f":"IF(I68=\"\",0,VLOOKUP(I68,PSMListe!Pflanzenschutz,2,FALSE))","v":0},{"$f":"IF(J68=\"\",0,VLOOKUP(J68,PSMListe!Pflanzenschutz,2,FALSE))","v":0},{"$f":"IF(K68=\"\",0,VLOOKUP(K68,PSMListe!Pflanzenschutz,2,FALSE))","v":0},{"$f":"IF(L68=\"\",0,VLOOKUP(L68,PSMListe!Pflanzenschutz,2,FALSE))","v":0},{"$f":"IF(M68=\"\",0,VLOOKUP(M68,PSMListe!Pflanzenschutz,2,FALSE))","v":0},{"$f":"IF(N68=\"\",0,VLOOKUP(N68,PSMListe!Pflanzenschutz,2,FALSE))","v":0},{"$f":"IF(O68=\"\",0,VLOOKUP(O68,PSMListe!Pflanzenschutz,2,FALSE))","v":0},{"$f":"IF(P68=\"\",0,VLOOKUP(P68,PSMListe!Pflanzenschutz,2,FALSE))","v":0},{"$f":"IF(Q68=\"\",0,VLOOKUP(Q68,PSMListe!Pflanzenschutz,2,FALSE))","v":0},{"$f":"IF(R68=\"\",0,VLOOKUP(R68,PSMListe!Pflanzenschutz,2,FALSE))","v":0},{"$f":"IF(S68=\"\",0,VLOOKUP(S68,PSMListe!Pflanzenschutz,2,FALSE))","v":0},{"$f":"IF(T68=\"\",0,VLOOKUP(T68,PSMListe!Pflanzenschutz,2,FALSE))","v":0},{"$f":"IF(U68=\"\",0,VLOOKUP(U68,PSMListe!Pflanzenschutz,2,FALSE))","v":0},{"$f":"IF(V68=\"\",0,VLOOKUP(V68,PSMListe!Pflanzenschutz,2,FALSE))","v":0},{"$f":"IF(W68=\"\",0,VLOOKUP(W68,PSMListe!Pflanzenschutz,2,FALSE))","v":0},{"$f":"IF(X68=\"\",0,VLOOKUP(X68,PSMListe!Pflanzenschutz,2,FALSE))","v":0},{"$f":"IF(Y68=\"\",0,VLOOKUP(Y68,PSMListe!Pflanzenschutz,2,FALSE))","v":0},{"$f":"IF(Z68=\"\",0,VLOOKUP(Z68,PSMListe!Pflanzenschutz,2,FALSE))","v":0},{"$f":"IF(AA68=\"\",0,VLOOKUP(AA68,PSMListe!Pflanzenschutz,2,FALSE))","v":0},{"$f":"IF(AB68=\"\",0,VLOOKUP(AB68,PSMListe!Pflanzenschutz,2,FALSE))","v":0},{"$f":"IF(AC68=\"\",0,VLOOKUP(AC68,PSMListe!Pflanzenschutz,2,FALSE))","v":0},{"$f":"IF(AD68=\"\",0,VLOOKUP(AD68,PSMListe!Pflanzenschutz,2,FALSE))","v":0},{"$f":"IF(AE68=\"\",0,VLOOKUP(AE68,PSMListe!Pflanzenschutz,2,FALSE))","v":0},{"$f":"IF(AF68=\"\",0,VLOOKUP(AF68,PSMListe!Pflanzenschutz,2,FALSE))","v":0},{"$f":"IF(AG68=\"\",0,VLOOKUP(AG68,PSMListe!Pflanzenschutz,2,FALSE))","v":0},{"$f":"IF(AH68=\"\",0,VLOOKUP(AH68,PSMListe!Pflanzenschutz,2,FALSE))","v":0},{"$f":"IF(AI68=\"\",0,VLOOKUP(AI68,PSMListe!Pflanzenschutz,2,FALSE))","v":0},{"$f":"IF(AJ68=\"\",0,VLOOKUP(AJ68,PSMListe!Pflanzenschutz,2,FALSE))","v":0},{"$f":"IF(AK68=\"\",0,VLOOKUP(AK68,PSMListe!Pflanzenschutz,2,FALSE))","v":0},{"$f":"IF(AL68=\"\",0,VLOOKUP(AL68,PSMListe!Pflanzenschutz,2,FALSE))","v":0},{"$f":"IF(AM68=\"\",0,VLOOKUP(AM68,PSMListe!Pflanzenschutz,2,FALSE))","v":0},{"$f":"IF(AN68=\"\",0,VLOOKUP(AN68,PSMListe!Pflanzenschutz,2,FALSE))","v":0},{"$f":"IF(AO68=\"\",0,VLOOKUP(AO68,PSMListe!Pflanzenschutz,2,FALSE))","v":0},{"$f":"IF(AP68=\"\",0,VLOOKUP(AP68,PSMListe!Pflanzenschutz,2,FALSE))","v":0},{"$f":"IF(AQ68=\"\",0,VLOOKUP(AQ68,PSMListe!Pflanzenschutz,2,FALSE))","v":0},{"$f":"IF(AR68=\"\",0,VLOOKUP(AR68,PSMListe!Pflanzenschutz,2,FALSE))","v":0},{"$f":"IF(AS68=\"\",0,VLOOKUP(AS68,PSMListe!Pflanzenschutz,2,FALSE))","v":0},{"$f":"IF(AT68=\"\",0,VLOOKUP(AT68,PSMListe!Pflanzenschutz,2,FALSE))","v":0},{"$f":"IF(AU68=\"\",0,VLOOKUP(AU68,PSMListe!Pflanzenschutz,2,FALSE))","v":0},{"$f":"IF(AV68=\"\",0,VLOOKUP(AV68,PSMListe!Pflanzenschutz,2,FALSE))","v":0},{"$f":"IF(AW68=\"\",0,VLOOKUP(AW68,PSMListe!Pflanzenschutz,2,FALSE))","v":0},{"$f":"IF(AX68=\"\",0,VLOOKUP(AX68,PSMListe!Pflanzenschutz,2,FALSE))","v":0},{"$f":"IF(AY68=\"\",0,VLOOKUP(AY68,PSMListe!Pflanzenschutz,2,FALSE))","v":0},{"$f":"IF(AZ68=\"\",0,VLOOKUP(AZ68,PSMListe!Pflanzenschutz,2,FALSE))","v":0},{"$f":"IF(BA68=\"\",0,VLOOKUP(BA68,PSMListe!Pflanzenschutz,2,FALSE))","v":0},{"$f":"IF(BB68=\"\",0,VLOOKUP(BB68,PSMListe!Pflanzenschutz,2,FALSE))","v":0},{"$f":"IF(BC68=\"\",0,VLOOKUP(BC68,PSMListe!Pflanzenschutz,2,FALSE))","v":0},{"$f":"IF(BD68=\"\",0,VLOOKUP(BD68,PSMListe!Pflanzenschutz,2,FALSE))","v":0},{"$f":"IF(BE68=\"\",0,VLOOKUP(BE68,PSMListe!Pflanzenschutz,2,FALSE))","v":0},{"$f":"IF(BF68=\"\",0,VLOOKUP(BF68,PSMListe!Pflanzenschutz,2,FALSE))","v":0},{"$f":"IF(BG68=\"\",0,VLOOKUP(BG68,PSMListe!Pflanzenschutz,2,FALSE))","v":0},{"$f":"IF(BH68=\"\",0,VLOOKUP(BH68,PSMListe!Pflanzenschutz,2,FALSE))","v":0},{"$f":"IF(BI68=\"\",0,VLOOKUP(BI68,PSMListe!Pflanzenschutz,2,FALSE))","v":0},{"$f":"IF(BJ68=\"\",0,VLOOKUP(BJ68,PSMListe!Pflanzenschutz,2,FALSE))","v":0}]
[null,"Menge"]
[null,"Bemerkung"]
[null,"Datum"]
[null,"Mittel 14"]
[null,"Preis",{"$f":"IF(C73=\"\",0,VLOOKUP(C73,PSMListe!Pflanzenschutz,2,FALSE))","v":0},{"$f":"IF(D73=\"\",0,VLOOKUP(D73,PSMListe!Pflanzenschutz,2,FALSE))","v":0},{"$f":"IF(E73=\"\",0,VLOOKUP(E73,PSMListe!Pflanzenschutz,2,FALSE))","v":0},{"$f":"IF(F73=\"\",0,VLOOKUP(F73,PSMListe!Pflanzenschutz,2,FALSE))","v":0},{"$f":"IF(G73=\"\",0,VLOOKUP(G73,PSMListe!Pflanzenschutz,2,FALSE))","v":0},{"$f":"IF(H73=\"\",0,VLOOKUP(H73,PSMListe!Pflanzenschutz,2,FALSE))","v":0},{"$f":"IF(I73=\"\",0,VLOOKUP(I73,PSMListe!Pflanzenschutz,2,FALSE))","v":0},{"$f":"IF(J73=\"\",0,VLOOKUP(J73,PSMListe!Pflanzenschutz,2,FALSE))","v":0},{"$f":"IF(K73=\"\",0,VLOOKUP(K73,PSMListe!Pflanzenschutz,2,FALSE))","v":0},{"$f":"IF(L73=\"\",0,VLOOKUP(L73,PSMListe!Pflanzenschutz,2,FALSE))","v":0},{"$f":"IF(M73=\"\",0,VLOOKUP(M73,PSMListe!Pflanzenschutz,2,FALSE))","v":0},{"$f":"IF(N73=\"\",0,VLOOKUP(N73,PSMListe!Pflanzenschutz,2,FALSE))","v":0},{"$f":"IF(O73=\"\",0,VLOOKUP(O73,PSMListe!Pflanzenschutz,2,FALSE))","v":0},{"$f":"IF(P73=\"\",0,VLOOKUP(P73,PSMListe!Pflanzenschutz,2,FALSE))","v":0},{"$f":"IF(Q73=\"\",0,VLOOKUP(Q73,PSMListe!Pflanzenschutz,2,FALSE))","v":0},{"$f":"IF(R73=\"\",0,VLOOKUP(R73,PSMListe!Pflanzenschutz,2,FALSE))","v":0},{"$f":"IF(S73=\"\",0,VLOOKUP(S73,PSMListe!Pflanzenschutz,2,FALSE))","v":0},{"$f":"IF(T73=\"\",0,VLOOKUP(T73,PSMListe!Pflanzenschutz,2,FALSE))","v":0},{"$f":"IF(U73=\"\",0,VLOOKUP(U73,PSMListe!Pflanzenschutz,2,FALSE))","v":0},{"$f":"IF(V73=\"\",0,VLOOKUP(V73,PSMListe!Pflanzenschutz,2,FALSE))","v":0},{"$f":"IF(W73=\"\",0,VLOOKUP(W73,PSMListe!Pflanzenschutz,2,FALSE))","v":0},{"$f":"IF(X73=\"\",0,VLOOKUP(X73,PSMListe!Pflanzenschutz,2,FALSE))","v":0},{"$f":"IF(Y73=\"\",0,VLOOKUP(Y73,PSMListe!Pflanzenschutz,2,FALSE))","v":0},{"$f":"IF(Z73=\"\",0,VLOOKUP(Z73,PSMListe!Pflanzenschutz,2,FALSE))","v":0},{"$f":"IF(AA73=\"\",0,VLOOKUP(AA73,PSMListe!Pflanzenschutz,2,FALSE))","v":0},{"$f":"IF(AB73=\"\",0,VLOOKUP(AB73,PSMListe!Pflanzenschutz,2,FALSE))","v":0},{"$f":"IF(AC73=\"\",0,VLOOKUP(AC73,PSMListe!Pflanzenschutz,2,FALSE))","v":0},{"$f":"IF(AD73=\"\",0,VLOOKUP(AD73,PSMListe!Pflanzenschutz,2,FALSE))","v":0},{"$f":"IF(AE73=\"\",0,VLOOKUP(AE73,PSMListe!Pflanzenschutz,2,FALSE))","v":0},{"$f":"IF(AF73=\"\",0,VLOOKUP(AF73,PSMListe!Pflanzenschutz,2,FALSE))","v":0},{"$f":"IF(AG73=\"\",0,VLOOKUP(AG73,PSMListe!Pflanzenschutz,2,FALSE))","v":0},{"$f":"IF(AH73=\"\",0,VLOOKUP(AH73,PSMListe!Pflanzenschutz,2,FALSE))","v":0},{"$f":"IF(AI73=\"\",0,VLOOKUP(AI73,PSMListe!Pflanzenschutz,2,FALSE))","v":0},{"$f":"IF(AJ73=\"\",0,VLOOKUP(AJ73,PSMListe!Pflanzenschutz,2,FALSE))","v":0},{"$f":"IF(AK73=\"\",0,VLOOKUP(AK73,PSMListe!Pflanzenschutz,2,FALSE))","v":0},{"$f":"IF(AL73=\"\",0,VLOOKUP(AL73,PSMListe!Pflanzenschutz,2,FALSE))","v":0},{"$f":"IF(AM73=\"\",0,VLOOKUP(AM73,PSMListe!Pflanzenschutz,2,FALSE))","v":0},{"$f":"IF(AN73=\"\",0,VLOOKUP(AN73,PSMListe!Pflanzenschutz,2,FALSE))","v":0},{"$f":"IF(AO73=\"\",0,VLOOKUP(AO73,PSMListe!Pflanzenschutz,2,FALSE))","v":0},{"$f":"IF(AP73=\"\",0,VLOOKUP(AP73,PSMListe!Pflanzenschutz,2,FALSE))","v":0},{"$f":"IF(AQ73=\"\",0,VLOOKUP(AQ73,PSMListe!Pflanzenschutz,2,FALSE))","v":0},{"$f":"IF(AR73=\"\",0,VLOOKUP(AR73,PSMListe!Pflanzenschutz,2,FALSE))","v":0},{"$f":"IF(AS73=\"\",0,VLOOKUP(AS73,PSMListe!Pflanzenschutz,2,FALSE))","v":0},{"$f":"IF(AT73=\"\",0,VLOOKUP(AT73,PSMListe!Pflanzenschutz,2,FALSE))","v":0},{"$f":"IF(AU73=\"\",0,VLOOKUP(AU73,PSMListe!Pflanzenschutz,2,FALSE))","v":0},{"$f":"IF(AV73=\"\",0,VLOOKUP(AV73,PSMListe!Pflanzenschutz,2,FALSE))","v":0},{"$f":"IF(AW73=\"\",0,VLOOKUP(AW73,PSMListe!Pflanzenschutz,2,FALSE))","v":0},{"$f":"IF(AX73=\"\",0,VLOOKUP(AX73,PSMListe!Pflanzenschutz,2,FALSE))","v":0},{"$f":"IF(AY73=\"\",0,VLOOKUP(AY73,PSMListe!Pflanzenschutz,2,FALSE))","v":0},{"$f":"IF(AZ73=\"\",0,VLOOKUP(AZ73,PSMListe!Pflanzenschutz,2,FALSE))","v":0},{"$f":"IF(BA73=\"\",0,VLOOKUP(BA73,PSMListe!Pflanzenschutz,2,FALSE))","v":0},{"$f":"IF(BB73=\"\",0,VLOOKUP(BB73,PSMListe!Pflanzenschutz,2,FALSE))","v":0},{"$f":"IF(BC73=\"\",0,VLOOKUP(BC73,PSMListe!Pflanzenschutz,2,FALSE))","v":0},{"$f":"IF(BD73=\"\",0,VLOOKUP(BD73,PSMListe!Pflanzenschutz,2,FALSE))","v":0},{"$f":"IF(BE73=\"\",0,VLOOKUP(BE73,PSMListe!Pflanzenschutz,2,FALSE))","v":0},{"$f":"IF(BF73=\"\",0,VLOOKUP(BF73,PSMListe!Pflanzenschutz,2,FALSE))","v":0},{"$f":"IF(BG73=\"\",0,VLOOKUP(BG73,PSMListe!Pflanzenschutz,2,FALSE))","v":0},{"$f":"IF(BH73=\"\",0,VLOOKUP(BH73,PSMListe!Pflanzenschutz,2,FALSE))","v":0},{"$f":"IF(BI73=\"\",0,VLOOKUP(BI73,PSMListe!Pflanzenschutz,2,FALSE))","v":0},{"$f":"IF(BJ73=\"\",0,VLOOKUP(BJ73,PSMListe!Pflanzenschutz,2,FALSE))","v":0}]
[null,"Menge"]
[null,"Bemerkung"]
[null,"Datum"]
[null,"Mittel 15"]
[null,"Preis",{"$f":"IF(C78=\"\",0,VLOOKUP(C78,PSMListe!Pflanzenschutz,2,FALSE))","v":0},{"$f":"IF(D78=\"\",0,VLOOKUP(D78,PSMListe!Pflanzenschutz,2,FALSE))","v":0},{"$f":"IF(E78=\"\",0,VLOOKUP(E78,PSMListe!Pflanzenschutz,2,FALSE))","v":0},{"$f":"IF(F78=\"\",0,VLOOKUP(F78,PSMListe!Pflanzenschutz,2,FALSE))","v":0},{"$f":"IF(G78=\"\",0,VLOOKUP(G78,PSMListe!Pflanzenschutz,2,FALSE))","v":0},{"$f":"IF(H78=\"\",0,VLOOKUP(H78,PSMListe!Pflanzenschutz,2,FALSE))","v":0},{"$f":"IF(I78=\"\",0,VLOOKUP(I78,PSMListe!Pflanzenschutz,2,FALSE))","v":0},{"$f":"IF(J78=\"\",0,VLOOKUP(J78,PSMListe!Pflanzenschutz,2,FALSE))","v":0},{"$f":"IF(K78=\"\",0,VLOOKUP(K78,PSMListe!Pflanzenschutz,2,FALSE))","v":0},{"$f":"IF(L78=\"\",0,VLOOKUP(L78,PSMListe!Pflanzenschutz,2,FALSE))","v":0},{"$f":"IF(M78=\"\",0,VLOOKUP(M78,PSMListe!Pflanzenschutz,2,FALSE))","v":0},{"$f":"IF(N78=\"\",0,VLOOKUP(N78,PSMListe!Pflanzenschutz,2,FALSE))","v":0},{"$f":"IF(O78=\"\",0,VLOOKUP(O78,PSMListe!Pflanzenschutz,2,FALSE))","v":0},{"$f":"IF(P78=\"\",0,VLOOKUP(P78,PSMListe!Pflanzenschutz,2,FALSE))","v":0},{"$f":"IF(Q78=\"\",0,VLOOKUP(Q78,PSMListe!Pflanzenschutz,2,FALSE))","v":0},{"$f":"IF(R78=\"\",0,VLOOKUP(R78,PSMListe!Pflanzenschutz,2,FALSE))","v":0},{"$f":"IF(S78=\"\",0,VLOOKUP(S78,PSMListe!Pflanzenschutz,2,FALSE))","v":0},{"$f":"IF(T78=\"\",0,VLOOKUP(T78,PSMListe!Pflanzenschutz,2,FALSE))","v":0},{"$f":"IF(U78=\"\",0,VLOOKUP(U78,PSMListe!Pflanzenschutz,2,FALSE))","v":0},{"$f":"IF(V78=\"\",0,VLOOKUP(V78,PSMListe!Pflanzenschutz,2,FALSE))","v":0},{"$f":"IF(W78=\"\",0,VLOOKUP(W78,PSMListe!Pflanzenschutz,2,FALSE))","v":0},{"$f":"IF(X78=\"\",0,VLOOKUP(X78,PSMListe!Pflanzenschutz,2,FALSE))","v":0},{"$f":"IF(Y78=\"\",0,VLOOKUP(Y78,PSMListe!Pflanzenschutz,2,FALSE))","v":0},{"$f":"IF(Z78=\"\",0,VLOOKUP(Z78,PSMListe!Pflanzenschutz,2,FALSE))","v":0},{"$f":"IF(AA78=\"\",0,VLOOKUP(AA78,PSMListe!Pflanzenschutz,2,FALSE))","v":0},{"$f":"IF(AB78=\"\",0,VLOOKUP(AB78,PSMListe!Pflanzenschutz,2,FALSE))","v":0},{"$f":"IF(AC78=\"\",0,VLOOKUP(AC78,PSMListe!Pflanzenschutz,2,FALSE))","v":0},{"$f":"IF(AD78=\"\",0,VLOOKUP(AD78,PSMListe!Pflanzenschutz,2,FALSE))","v":0},{"$f":"IF(AE78=\"\",0,VLOOKUP(AE78,PSMListe!Pflanzenschutz,2,FALSE))","v":0},{"$f":"IF(AF78=\"\",0,VLOOKUP(AF78,PSMListe!Pflanzenschutz,2,FALSE))","v":0},{"$f":"IF(AG78=\"\",0,VLOOKUP(AG78,PSMListe!Pflanzenschutz,2,FALSE))","v":0},{"$f":"IF(AH78=\"\",0,VLOOKUP(AH78,PSMListe!Pflanzenschutz,2,FALSE))","v":0},{"$f":"IF(AI78=\"\",0,VLOOKUP(AI78,PSMListe!Pflanzenschutz,2,FALSE))","v":0},{"$f":"IF(AJ78=\"\",0,VLOOKUP(AJ78,PSMListe!Pflanzenschutz,2,FALSE))","v":0},{"$f":"IF(AK78=\"\",0,VLOOKUP(AK78,PSMListe!Pflanzenschutz,2,FALSE))","v":0},{"$f":"IF(AL78=\"\",0,VLOOKUP(AL78,PSMListe!Pflanzenschutz,2,FALSE))","v":0},{"$f":"IF(AM78=\"\",0,VLOOKUP(AM78,PSMListe!Pflanzenschutz,2,FALSE))","v":0},{"$f":"IF(AN78=\"\",0,VLOOKUP(AN78,PSMListe!Pflanzenschutz,2,FALSE))","v":0},{"$f":"IF(AO78=\"\",0,VLOOKUP(AO78,PSMListe!Pflanzenschutz,2,FALSE))","v":0},{"$f":"IF(AP78=\"\",0,VLOOKUP(AP78,PSMListe!Pflanzenschutz,2,FALSE))","v":0},{"$f":"IF(AQ78=\"\",0,VLOOKUP(AQ78,PSMListe!Pflanzenschutz,2,FALSE))","v":0},{"$f":"IF(AR78=\"\",0,VLOOKUP(AR78,PSMListe!Pflanzenschutz,2,FALSE))","v":0},{"$f":"IF(AS78=\"\",0,VLOOKUP(AS78,PSMListe!Pflanzenschutz,2,FALSE))","v":0},{"$f":"IF(AT78=\"\",0,VLOOKUP(AT78,PSMListe!Pflanzenschutz,2,FALSE))","v":0},{"$f":"IF(AU78=\"\",0,VLOOKUP(AU78,PSMListe!Pflanzenschutz,2,FALSE))","v":0},{"$f":"IF(AV78=\"\",0,VLOOKUP(AV78,PSMListe!Pflanzenschutz,2,FALSE))","v":0},{"$f":"IF(AW78=\"\",0,VLOOKUP(AW78,PSMListe!Pflanzenschutz,2,FALSE))","v":0},{"$f":"IF(AX78=\"\",0,VLOOKUP(AX78,PSMListe!Pflanzenschutz,2,FALSE))","v":0},{"$f":"IF(AY78=\"\",0,VLOOKUP(AY78,PSMListe!Pflanzenschutz,2,FALSE))","v":0},{"$f":"IF(AZ78=\"\",0,VLOOKUP(AZ78,PSMListe!Pflanzenschutz,2,FALSE))","v":0},{"$f":"IF(BA78=\"\",0,VLOOKUP(BA78,PSMListe!Pflanzenschutz,2,FALSE))","v":0},{"$f":"IF(BB78=\"\",0,VLOOKUP(BB78,PSMListe!Pflanzenschutz,2,FALSE))","v":0},{"$f":"IF(BC78=\"\",0,VLOOKUP(BC78,PSMListe!Pflanzenschutz,2,FALSE))","v":0},{"$f":"IF(BD78=\"\",0,VLOOKUP(BD78,PSMListe!Pflanzenschutz,2,FALSE))","v":0},{"$f":"IF(BE78=\"\",0,VLOOKUP(BE78,PSMListe!Pflanzenschutz,2,FALSE))","v":0},{"$f":"IF(BF78=\"\",0,VLOOKUP(BF78,PSMListe!Pflanzenschutz,2,FALSE))","v":0},{"$f":"IF(BG78=\"\",0,VLOOKUP(BG78,PSMListe!Pflanzenschutz,2,FALSE))","v":0},{"$f":"IF(BH78=\"\",0,VLOOKUP(BH78,PSMListe!Pflanzenschutz,2,FALSE))","v":0},{"$f":"IF(BI78=\"\",0,VLOOKUP(BI78,PSMListe!Pflanzenschutz,2,FALSE))","v":0},{"$f":"IF(BJ78=\"\",0,VLOOKUP(BJ78,PSMListe!Pflanzenschutz,2,FALSE))","v":0}]
[null,"Menge"]
[null,"Bemerkung"]
[null,"Datum"]
[null,"Mittel 16"]
[null,"Preis",{"$f":"IF(C83=\"\",0,VLOOKUP(C83,PSMListe!Pflanzenschutz,2,FALSE))","v":0},{"$f":"IF(D83=\"\",0,VLOOKUP(D83,PSMListe!Pflanzenschutz,2,FALSE))","v":0},{"$f":"IF(E83=\"\",0,VLOOKUP(E83,PSMListe!Pflanzenschutz,2,FALSE))","v":0},{"$f":"IF(F83=\"\",0,VLOOKUP(F83,PSMListe!Pflanzenschutz,2,FALSE))","v":0},{"$f":"IF(G83=\"\",0,VLOOKUP(G83,PSMListe!Pflanzenschutz,2,FALSE))","v":0},{"$f":"IF(H83=\"\",0,VLOOKUP(H83,PSMListe!Pflanzenschutz,2,FALSE))","v":0},{"$f":"IF(I83=\"\",0,VLOOKUP(I83,PSMListe!Pflanzenschutz,2,FALSE))","v":0},{"$f":"IF(J83=\"\",0,VLOOKUP(J83,PSMListe!Pflanzenschutz,2,FALSE))","v":0},{"$f":"IF(K83=\"\",0,VLOOKUP(K83,PSMListe!Pflanzenschutz,2,FALSE))","v":0},{"$f":"IF(L83=\"\",0,VLOOKUP(L83,PSMListe!Pflanzenschutz,2,FALSE))","v":0},{"$f":"IF(M83=\"\",0,VLOOKUP(M83,PSMListe!Pflanzenschutz,2,FALSE))","v":0},{"$f":"IF(N83=\"\",0,VLOOKUP(N83,PSMListe!Pflanzenschutz,2,FALSE))","v":0},{"$f":"IF(O83=\"\",0,VLOOKUP(O83,PSMListe!Pflanzenschutz,2,FALSE))","v":0},{"$f":"IF(P83=\"\",0,VLOOKUP(P83,PSMListe!Pflanzenschutz,2,FALSE))","v":0},{"$f":"IF(Q83=\"\",0,VLOOKUP(Q83,PSMListe!Pflanzenschutz,2,FALSE))","v":0},{"$f":"IF(R83=\"\",0,VLOOKUP(R83,PSMListe!Pflanzenschutz,2,FALSE))","v":0},{"$f":"IF(S83=\"\",0,VLOOKUP(S83,PSMListe!Pflanzenschutz,2,FALSE))","v":0},{"$f":"IF(T83=\"\",0,VLOOKUP(T83,PSMListe!Pflanzenschutz,2,FALSE))","v":0},{"$f":"IF(U83=\"\",0,VLOOKUP(U83,PSMListe!Pflanzenschutz,2,FALSE))","v":0},{"$f":"IF(V83=\"\",0,VLOOKUP(V83,PSMListe!Pflanzenschutz,2,FALSE))","v":0},{"$f":"IF(W83=\"\",0,VLOOKUP(W83,PSMListe!Pflanzenschutz,2,FALSE))","v":0},{"$f":"IF(X83=\"\",0,VLOOKUP(X83,PSMListe!Pflanzenschutz,2,FALSE))","v":0},{"$f":"IF(Y83=\"\",0,VLOOKUP(Y83,PSMListe!Pflanzenschutz,2,FALSE))","v":0},{"$f":"IF(Z83=\"\",0,VLOOKUP(Z83,PSMListe!Pflanzenschutz,2,FALSE))","v":0},{"$f":"IF(AA83=\"\",0,VLOOKUP(AA83,PSMListe!Pflanzenschutz,2,FALSE))","v":0},{"$f":"IF(AB83=\"\",0,VLOOKUP(AB83,PSMListe!Pflanzenschutz,2,FALSE))","v":0},{"$f":"IF(AC83=\"\",0,VLOOKUP(AC83,PSMListe!Pflanzenschutz,2,FALSE))","v":0},{"$f":"IF(AD83=\"\",0,VLOOKUP(AD83,PSMListe!Pflanzenschutz,2,FALSE))","v":0},{"$f":"IF(AE83=\"\",0,VLOOKUP(AE83,PSMListe!Pflanzenschutz,2,FALSE))","v":0},{"$f":"IF(AF83=\"\",0,VLOOKUP(AF83,PSMListe!Pflanzenschutz,2,FALSE))","v":0},{"$f":"IF(AG83=\"\",0,VLOOKUP(AG83,PSMListe!Pflanzenschutz,2,FALSE))","v":0},{"$f":"IF(AH83=\"\",0,VLOOKUP(AH83,PSMListe!Pflanzenschutz,2,FALSE))","v":0},{"$f":"IF(AI83=\"\",0,VLOOKUP(AI83,PSMListe!Pflanzenschutz,2,FALSE))","v":0},{"$f":"IF(AJ83=\"\",0,VLOOKUP(AJ83,PSMListe!Pflanzenschutz,2,FALSE))","v":0},{"$f":"IF(AK83=\"\",0,VLOOKUP(AK83,PSMListe!Pflanzenschutz,2,FALSE))","v":0},{"$f":"IF(AL83=\"\",0,VLOOKUP(AL83,PSMListe!Pflanzenschutz,2,FALSE))","v":0},{"$f":"IF(AM83=\"\",0,VLOOKUP(AM83,PSMListe!Pflanzenschutz,2,FALSE))","v":0},{"$f":"IF(AN83=\"\",0,VLOOKUP(AN83,PSMListe!Pflanzenschutz,2,FALSE))","v":0},{"$f":"IF(AO83=\"\",0,VLOOKUP(AO83,PSMListe!Pflanzenschutz,2,FALSE))","v":0},{"$f":"IF(AP83=\"\",0,VLOOKUP(AP83,PSMListe!Pflanzenschutz,2,FALSE))","v":0},{"$f":"IF(AQ83=\"\",0,VLOOKUP(AQ83,PSMListe!Pflanzenschutz,2,FALSE))","v":0},{"$f":"IF(AR83=\"\",0,VLOOKUP(AR83,PSMListe!Pflanzenschutz,2,FALSE))","v":0},{"$f":"IF(AS83=\"\",0,VLOOKUP(AS83,PSMListe!Pflanzenschutz,2,FALSE))","v":0},{"$f":"IF(AT83=\"\",0,VLOOKUP(AT83,PSMListe!Pflanzenschutz,2,FALSE))","v":0},{"$f":"IF(AU83=\"\",0,VLOOKUP(AU83,PSMListe!Pflanzenschutz,2,FALSE))","v":0},{"$f":"IF(AV83=\"\",0,VLOOKUP(AV83,PSMListe!Pflanzenschutz,2,FALSE))","v":0},{"$f":"IF(AW83=\"\",0,VLOOKUP(AW83,PSMListe!Pflanzenschutz,2,FALSE))","v":0},{"$f":"IF(AX83=\"\",0,VLOOKUP(AX83,PSMListe!Pflanzenschutz,2,FALSE))","v":0},{"$f":"IF(AY83=\"\",0,VLOOKUP(AY83,PSMListe!Pflanzenschutz,2,FALSE))","v":0},{"$f":"IF(AZ83=\"\",0,VLOOKUP(AZ83,PSMListe!Pflanzenschutz,2,FALSE))","v":0},{"$f":"IF(BA83=\"\",0,VLOOKUP(BA83,PSMListe!Pflanzenschutz,2,FALSE))","v":0},{"$f":"IF(BB83=\"\",0,VLOOKUP(BB83,PSMListe!Pflanzenschutz,2,FALSE))","v":0},{"$f":"IF(BC83=\"\",0,VLOOKUP(BC83,PSMListe!Pflanzenschutz,2,FALSE))","v":0},{"$f":"IF(BD83=\"\",0,VLOOKUP(BD83,PSMListe!Pflanzenschutz,2,FALSE))","v":0},{"$f":"IF(BE83=\"\",0,VLOOKUP(BE83,PSMListe!Pflanzenschutz,2,FALSE))","v":0},{"$f":"IF(BF83=\"\",0,VLOOKUP(BF83,PSMListe!Pflanzenschutz,2,FALSE))","v":0},{"$f":"IF(BG83=\"\",0,VLOOKUP(BG83,PSMListe!Pflanzenschutz,2,FALSE))","v":0},{"$f":"IF(BH83=\"\",0,VLOOKUP(BH83,PSMListe!Pflanzenschutz,2,FALSE))","v":0},{"$f":"IF(BI83=\"\",0,VLOOKUP(BI83,PSMListe!Pflanzenschutz,2,FALSE))","v":0},{"$f":"IF(BJ83=\"\",0,VLOOKUP(BJ83,PSMListe!Pflanzenschutz,2,FALSE))","v":0}]
[null,"Menge"]
[null,"Bemerkung"]
[null,"Datum"]
[null,"Mittel 17"]
[null,"Preis",{"$f":"IF(C88=\"\",0,VLOOKUP(C88,PSMListe!Pflanzenschutz,2,FALSE))","v":0},{"$f":"IF(D88=\"\",0,VLOOKUP(D88,PSMListe!Pflanzenschutz,2,FALSE))","v":0},{"$f":"IF(E88=\"\",0,VLOOKUP(E88,PSMListe!Pflanzenschutz,2,FALSE))","v":0},{"$f":"IF(F88=\"\",0,VLOOKUP(F88,PSMListe!Pflanzenschutz,2,FALSE))","v":0},{"$f":"IF(G88=\"\",0,VLOOKUP(G88,PSMListe!Pflanzenschutz,2,FALSE))","v":0},{"$f":"IF(H88=\"\",0,VLOOKUP(H88,PSMListe!Pflanzenschutz,2,FALSE))","v":0},{"$f":"IF(I88=\"\",0,VLOOKUP(I88,PSMListe!Pflanzenschutz,2,FALSE))","v":0},{"$f":"IF(J88=\"\",0,VLOOKUP(J88,PSMListe!Pflanzenschutz,2,FALSE))","v":0},{"$f":"IF(K88=\"\",0,VLOOKUP(K88,PSMListe!Pflanzenschutz,2,FALSE))","v":0},{"$f":"IF(L88=\"\",0,VLOOKUP(L88,PSMListe!Pflanzenschutz,2,FALSE))","v":0},{"$f":"IF(M88=\"\",0,VLOOKUP(M88,PSMListe!Pflanzenschutz,2,FALSE))","v":0},{"$f":"IF(N88=\"\",0,VLOOKUP(N88,PSMListe!Pflanzenschutz,2,FALSE))","v":0},{"$f":"IF(O88=\"\",0,VLOOKUP(O88,PSMListe!Pflanzenschutz,2,FALSE))","v":0},{"$f":"IF(P88=\"\",0,VLOOKUP(P88,PSMListe!Pflanzenschutz,2,FALSE))","v":0},{"$f":"IF(Q88=\"\",0,VLOOKUP(Q88,PSMListe!Pflanzenschutz,2,FALSE))","v":0},{"$f":"IF(R88=\"\",0,VLOOKUP(R88,PSMListe!Pflanzenschutz,2,FALSE))","v":0},{"$f":"IF(S88=\"\",0,VLOOKUP(S88,PSMListe!Pflanzenschutz,2,FALSE))","v":0},{"$f":"IF(T88=\"\",0,VLOOKUP(T88,PSMListe!Pflanzenschutz,2,FALSE))","v":0},{"$f":"IF(U88=\"\",0,VLOOKUP(U88,PSMListe!Pflanzenschutz,2,FALSE))","v":0},{"$f":"IF(V88=\"\",0,VLOOKUP(V88,PSMListe!Pflanzenschutz,2,FALSE))","v":0},{"$f":"IF(W88=\"\",0,VLOOKUP(W88,PSMListe!Pflanzenschutz,2,FALSE))","v":0},{"$f":"IF(X88=\"\",0,VLOOKUP(X88,PSMListe!Pflanzenschutz,2,FALSE))","v":0},{"$f":"IF(Y88=\"\",0,VLOOKUP(Y88,PSMListe!Pflanzenschutz,2,FALSE))","v":0},{"$f":"IF(Z88=\"\",0,VLOOKUP(Z88,PSMListe!Pflanzenschutz,2,FALSE))","v":0},{"$f":"IF(AA88=\"\",0,VLOOKUP(AA88,PSMListe!Pflanzenschutz,2,FALSE))","v":0},{"$f":"IF(AB88=\"\",0,VLOOKUP(AB88,PSMListe!Pflanzenschutz,2,FALSE))","v":0},{"$f":"IF(AC88=\"\",0,VLOOKUP(AC88,PSMListe!Pflanzenschutz,2,FALSE))","v":0},{"$f":"IF(AD88=\"\",0,VLOOKUP(AD88,PSMListe!Pflanzenschutz,2,FALSE))","v":0},{"$f":"IF(AE88=\"\",0,VLOOKUP(AE88,PSMListe!Pflanzenschutz,2,FALSE))","v":0},{"$f":"IF(AF88=\"\",0,VLOOKUP(AF88,PSMListe!Pflanzenschutz,2,FALSE))","v":0},{"$f":"IF(AG88=\"\",0,VLOOKUP(AG88,PSMListe!Pflanzenschutz,2,FALSE))","v":0},{"$f":"IF(AH88=\"\",0,VLOOKUP(AH88,PSMListe!Pflanzenschutz,2,FALSE))","v":0},{"$f":"IF(AI88=\"\",0,VLOOKUP(AI88,PSMListe!Pflanzenschutz,2,FALSE))","v":0},{"$f":"IF(AJ88=\"\",0,VLOOKUP(AJ88,PSMListe!Pflanzenschutz,2,FALSE))","v":0},{"$f":"IF(AK88=\"\",0,VLOOKUP(AK88,PSMListe!Pflanzenschutz,2,FALSE))","v":0},{"$f":"IF(AL88=\"\",0,VLOOKUP(AL88,PSMListe!Pflanzenschutz,2,FALSE))","v":0},{"$f":"IF(AM88=\"\",0,VLOOKUP(AM88,PSMListe!Pflanzenschutz,2,FALSE))","v":0},{"$f":"IF(AN88=\"\",0,VLOOKUP(AN88,PSMListe!Pflanzenschutz,2,FALSE))","v":0},{"$f":"IF(AO88=\"\",0,VLOOKUP(AO88,PSMListe!Pflanzenschutz,2,FALSE))","v":0},{"$f":"IF(AP88=\"\",0,VLOOKUP(AP88,PSMListe!Pflanzenschutz,2,FALSE))","v":0},{"$f":"IF(AQ88=\"\",0,VLOOKUP(AQ88,PSMListe!Pflanzenschutz,2,FALSE))","v":0},{"$f":"IF(AR88=\"\",0,VLOOKUP(AR88,PSMListe!Pflanzenschutz,2,FALSE))","v":0},{"$f":"IF(AS88=\"\",0,VLOOKUP(AS88,PSMListe!Pflanzenschutz,2,FALSE))","v":0},{"$f":"IF(AT88=\"\",0,VLOOKUP(AT88,PSMListe!Pflanzenschutz,2,FALSE))","v":0},{"$f":"IF(AU88=\"\",0,VLOOKUP(AU88,PSMListe!Pflanzenschutz,2,FALSE))","v":0},{"$f":"IF(AV88=\"\",0,VLOOKUP(AV88,PSMListe!Pflanzenschutz,2,FALSE))","v":0},{"$f":"IF(AW88=\"\",0,VLOOKUP(AW88,PSMListe!Pflanzenschutz,2,FALSE))","v":0},{"$f":"IF(AX88=\"\",0,VLOOKUP(AX88,PSMListe!Pflanzenschutz,2,FALSE))","v":0},{"$f":"IF(AY88=\"\",0,VLOOKUP(AY88,PSMListe!Pflanzenschutz,2,FALSE))","v":0},{"$f":"IF(AZ88=\"\",0,VLOOKUP(AZ88,PSMListe!Pflanzenschutz,2,FALSE))","v":0},{"$f":"IF(BA88=\"\",0,VLOOKUP(BA88,PSMListe!Pflanzenschutz,2,FALSE))","v":0},{"$f":"IF(BB88=\"\",0,VLOOKUP(BB88,PSMListe!Pflanzenschutz,2,FALSE))","v":0},{"$f":"IF(BC88=\"\",0,VLOOKUP(BC88,PSMListe!Pflanzenschutz,2,FALSE))","v":0},{"$f":"IF(BD88=\"\",0,VLOOKUP(BD88,PSMListe!Pflanzenschutz,2,FALSE))","v":0},{"$f":"IF(BE88=\"\",0,VLOOKUP(BE88,PSMListe!Pflanzenschutz,2,FALSE))","v":0},{"$f":"IF(BF88=\"\",0,VLOOKUP(BF88,PSMListe!Pflanzenschutz,2,FALSE))","v":0},{"$f":"IF(BG88=\"\",0,VLOOKUP(BG88,PSMListe!Pflanzenschutz,2,FALSE))","v":0},{"$f":"IF(BH88=\"\",0,VLOOKUP(BH88,PSMListe!Pflanzenschutz,2,FALSE))","v":0},{"$f":"IF(BI88=\"\",0,VLOOKUP(BI88,PSMListe!Pflanzenschutz,2,FALSE))","v":0},{"$f":"IF(BJ88=\"\",0,VLOOKUP(BJ88,PSMListe!Pflanzenschutz,2,FALSE))","v":0}]
[null,"Menge"]
[null,"Bemerkung"]
[null,"Datum"]
[null,"Mittel 18"]
[null,"Preis",{"$f":"IF(C93=\"\",0,VLOOKUP(C93,PSMListe!Pflanzenschutz,2,FALSE))","v":0},{"$f":"IF(D93=\"\",0,VLOOKUP(D93,PSMListe!Pflanzenschutz,2,FALSE))","v":0},{"$f":"IF(E93=\"\",0,VLOOKUP(E93,PSMListe!Pflanzenschutz,2,FALSE))","v":0},{"$f":"IF(F93=\"\",0,VLOOKUP(F93,PSMListe!Pflanzenschutz,2,FALSE))","v":0},{"$f":"IF(G93=\"\",0,VLOOKUP(G93,PSMListe!Pflanzenschutz,2,FALSE))","v":0},{"$f":"IF(H93=\"\",0,VLOOKUP(H93,PSMListe!Pflanzenschutz,2,FALSE))","v":0},{"$f":"IF(I93=\"\",0,VLOOKUP(I93,PSMListe!Pflanzenschutz,2,FALSE))","v":0},{"$f":"IF(J93=\"\",0,VLOOKUP(J93,PSMListe!Pflanzenschutz,2,FALSE))","v":0},{"$f":"IF(K93=\"\",0,VLOOKUP(K93,PSMListe!Pflanzenschutz,2,FALSE))","v":0},{"$f":"IF(L93=\"\",0,VLOOKUP(L93,PSMListe!Pflanzenschutz,2,FALSE))","v":0},{"$f":"IF(M93=\"\",0,VLOOKUP(M93,PSMListe!Pflanzenschutz,2,FALSE))","v":0},{"$f":"IF(N93=\"\",0,VLOOKUP(N93,PSMListe!Pflanzenschutz,2,FALSE))","v":0},{"$f":"IF(O93=\"\",0,VLOOKUP(O93,PSMListe!Pflanzenschutz,2,FALSE))","v":0},{"$f":"IF(P93=\"\",0,VLOOKUP(P93,PSMListe!Pflanzenschutz,2,FALSE))","v":0},{"$f":"IF(Q93=\"\",0,VLOOKUP(Q93,PSMListe!Pflanzenschutz,2,FALSE))","v":0},{"$f":"IF(R93=\"\",0,VLOOKUP(R93,PSMListe!Pflanzenschutz,2,FALSE))","v":0},{"$f":"IF(S93=\"\",0,VLOOKUP(S93,PSMListe!Pflanzenschutz,2,FALSE))","v":0},{"$f":"IF(T93=\"\",0,VLOOKUP(T93,PSMListe!Pflanzenschutz,2,FALSE))","v":0},{"$f":"IF(U93=\"\",0,VLOOKUP(U93,PSMListe!Pflanzenschutz,2,FALSE))","v":0},{"$f":"IF(V93=\"\",0,VLOOKUP(V93,PSMListe!Pflanzenschutz,2,FALSE))","v":0},{"$f":"IF(W93=\"\",0,VLOOKUP(W93,PSMListe!Pflanzenschutz,2,FALSE))","v":0},{"$f":"IF(X93=\"\",0,VLOOKUP(X93,PSMListe!Pflanzenschutz,2,FALSE))","v":0},{"$f":"IF(Y93=\"\",0,VLOOKUP(Y93,PSMListe!Pflanzenschutz,2,FALSE))","v":0},{"$f":"IF(Z93=\"\",0,VLOOKUP(Z93,PSMListe!Pflanzenschutz,2,FALSE))","v":0},{"$f":"IF(AA93=\"\",0,VLOOKUP(AA93,PSMListe!Pflanzenschutz,2,FALSE))","v":0},{"$f":"IF(AB93=\"\",0,VLOOKUP(AB93,PSMListe!Pflanzenschutz,2,FALSE))","v":0},{"$f":"IF(AC93=\"\",0,VLOOKUP(AC93,PSMListe!Pflanzenschutz,2,FALSE))","v":0},{"$f":"IF(AD93=\"\",0,VLOOKUP(AD93,PSMListe!Pflanzenschutz,2,FALSE))","v":0},{"$f":"IF(AE93=\"\",0,VLOOKUP(AE93,PSMListe!Pflanzenschutz,2,FALSE))","v":0},{"$f":"IF(AF93=\"\",0,VLOOKUP(AF93,PSMListe!Pflanzenschutz,2,FALSE))","v":0},{"$f":"IF(AG93=\"\",0,VLOOKUP(AG93,PSMListe!Pflanzenschutz,2,FALSE))","v":0},{"$f":"IF(AH93=\"\",0,VLOOKUP(AH93,PSMListe!Pflanzenschutz,2,FALSE))","v":0},{"$f":"IF(AI93=\"\",0,VLOOKUP(AI93,PSMListe!Pflanzenschutz,2,FALSE))","v":0},{"$f":"IF(AJ93=\"\",0,VLOOKUP(AJ93,PSMListe!Pflanzenschutz,2,FALSE))","v":0},{"$f":"IF(AK93=\"\",0,VLOOKUP(AK93,PSMListe!Pflanzenschutz,2,FALSE))","v":0},{"$f":"IF(AL93=\"\",0,VLOOKUP(AL93,PSMListe!Pflanzenschutz,2,FALSE))","v":0},{"$f":"IF(AM93=\"\",0,VLOOKUP(AM93,PSMListe!Pflanzenschutz,2,FALSE))","v":0},{"$f":"IF(AN93=\"\",0,VLOOKUP(AN93,PSMListe!Pflanzenschutz,2,FALSE))","v":0},{"$f":"IF(AO93=\"\",0,VLOOKUP(AO93,PSMListe!Pflanzenschutz,2,FALSE))","v":0},{"$f":"IF(AP93=\"\",0,VLOOKUP(AP93,PSMListe!Pflanzenschutz,2,FALSE))","v":0},{"$f":"IF(AQ93=\"\",0,VLOOKUP(AQ93,PSMListe!Pflanzenschutz,2,FALSE))","v":0},{"$f":"IF(AR93=\"\",0,VLOOKUP(AR93,PSMListe!Pflanzenschutz,2,FALSE))","v":0},{"$f":"IF(AS93=\"\",0,VLOOKUP(AS93,PSMListe!Pflanzenschutz,2,FALSE))","v":0},{"$f":"IF(AT93=\"\",0,VLOOKUP(AT93,PSMListe!Pflanzenschutz,2,FALSE))","v":0},{"$f":"IF(AU93=\"\",0,VLOOKUP(AU93,PSMListe!Pflanzenschutz,2,FALSE))","v":0},{"$f":"IF(AV93=\"\",0,VLOOKUP(AV93,PSMListe!Pflanzenschutz,2,FALSE))","v":0},{"$f":"IF(AW93=\"\",0,VLOOKUP(AW93,PSMListe!Pflanzenschutz,2,FALSE))","v":0},{"$f":"IF(AX93=\"\",0,VLOOKUP(AX93,PSMListe!Pflanzenschutz,2,FALSE))","v":0},{"$f":"IF(AY93=\"\",0,VLOOKUP(AY93,PSMListe!Pflanzenschutz,2,FALSE))","v":0},{"$f":"IF(AZ93=\"\",0,VLOOKUP(AZ93,PSMListe!Pflanzenschutz,2,FALSE))","v":0},{"$f":"IF(BA93=\"\",0,VLOOKUP(BA93,PSMListe!Pflanzenschutz,2,FALSE))","v":0},{"$f":"IF(BB93=\"\",0,VLOOKUP(BB93,PSMListe!Pflanzenschutz,2,FALSE))","v":0},{"$f":"IF(BC93=\"\",0,VLOOKUP(BC93,PSMListe!Pflanzenschutz,2,FALSE))","v":0},{"$f":"IF(BD93=\"\",0,VLOOKUP(BD93,PSMListe!Pflanzenschutz,2,FALSE))","v":0},{"$f":"IF(BE93=\"\",0,VLOOKUP(BE93,PSMListe!Pflanzenschutz,2,FALSE))","v":0},{"$f":"IF(BF93=\"\",0,VLOOKUP(BF93,PSMListe!Pflanzenschutz,2,FALSE))","v":0},{"$f":"IF(BG93=\"\",0,VLOOKUP(BG93,PSMListe!Pflanzenschutz,2,FALSE))","v":0},{"$f":"IF(BH93=\"\",0,VLOOKUP(BH93,PSMListe!Pflanzenschutz,2,FALSE))","v":0},{"$f":"IF(BI93=\"\",0,VLOOKUP(BI93,PSMListe!Pflanzenschutz,2,FALSE))","v":0},{"$f":"IF(BJ93=\"\",0,VLOOKUP(BJ93,PSMListe!Pflanzenschutz,2,FALSE))","v":0}]
[null,"Menge"]
[null,"Bemerkung"]
[null,"Datum"]
[null,"Mittel 19"]
[null,"Preis",{"$f":"IF(C98=\"\",0,VLOOKUP(C98,PSMListe!Pflanzenschutz,2,FALSE))","v":0},{"$f":"IF(D98=\"\",0,VLOOKUP(D98,PSMListe!Pflanzenschutz,2,FALSE))","v":0},{"$f":"IF(E98=\"\",0,VLOOKUP(E98,PSMListe!Pflanzenschutz,2,FALSE))","v":0},{"$f":"IF(F98=\"\",0,VLOOKUP(F98,PSMListe!Pflanzenschutz,2,FALSE))","v":0},{"$f":"IF(G98=\"\",0,VLOOKUP(G98,PSMListe!Pflanzenschutz,2,FALSE))","v":0},{"$f":"IF(H98=\"\",0,VLOOKUP(H98,PSMListe!Pflanzenschutz,2,FALSE))","v":0},{"$f":"IF(I98=\"\",0,VLOOKUP(I98,PSMListe!Pflanzenschutz,2,FALSE))","v":0},{"$f":"IF(J98=\"\",0,VLOOKUP(J98,PSMListe!Pflanzenschutz,2,FALSE))","v":0},{"$f":"IF(K98=\"\",0,VLOOKUP(K98,PSMListe!Pflanzenschutz,2,FALSE))","v":0},{"$f":"IF(L98=\"\",0,VLOOKUP(L98,PSMListe!Pflanzenschutz,2,FALSE))","v":0},{"$f":"IF(M98=\"\",0,VLOOKUP(M98,PSMListe!Pflanzenschutz,2,FALSE))","v":0},{"$f":"IF(N98=\"\",0,VLOOKUP(N98,PSMListe!Pflanzenschutz,2,FALSE))","v":0},{"$f":"IF(O98=\"\",0,VLOOKUP(O98,PSMListe!Pflanzenschutz,2,FALSE))","v":0},{"$f":"IF(P98=\"\",0,VLOOKUP(P98,PSMListe!Pflanzenschutz,2,FALSE))","v":0},{"$f":"IF(Q98=\"\",0,VLOOKUP(Q98,PSMListe!Pflanzenschutz,2,FALSE))","v":0},{"$f":"IF(R98=\"\",0,VLOOKUP(R98,PSMListe!Pflanzenschutz,2,FALSE))","v":0},{"$f":"IF(S98=\"\",0,VLOOKUP(S98,PSMListe!Pflanzenschutz,2,FALSE))","v":0},{"$f":"IF(T98=\"\",0,VLOOKUP(T98,PSMListe!Pflanzenschutz,2,FALSE))","v":0},{"$f":"IF(U98=\"\",0,VLOOKUP(U98,PSMListe!Pflanzenschutz,2,FALSE))","v":0},{"$f":"IF(V98=\"\",0,VLOOKUP(V98,PSMListe!Pflanzenschutz,2,FALSE))","v":0},{"$f":"IF(W98=\"\",0,VLOOKUP(W98,PSMListe!Pflanzenschutz,2,FALSE))","v":0},{"$f":"IF(X98=\"\",0,VLOOKUP(X98,PSMListe!Pflanzenschutz,2,FALSE))","v":0},{"$f":"IF(Y98=\"\",0,VLOOKUP(Y98,PSMListe!Pflanzenschutz,2,FALSE))","v":0},{"$f":"IF(Z98=\"\",0,VLOOKUP(Z98,PSMListe!Pflanzenschutz,2,FALSE))","v":0},{"$f":"IF(AA98=\"\",0,VLOOKUP(AA98,PSMListe!Pflanzenschutz,2,FALSE))","v":0},{"$f":"IF(AB98=\"\",0,VLOOKUP(AB98,PSMListe!Pflanzenschutz,2,FALSE))","v":0},{"$f":"IF(AC98=\"\",0,VLOOKUP(AC98,PSMListe!Pflanzenschutz,2,FALSE))","v":0},{"$f":"IF(AD98=\"\",0,VLOOKUP(AD98,PSMListe!Pflanzenschutz,2,FALSE))","v":0},{"$f":"IF(AE98=\"\",0,VLOOKUP(AE98,PSMListe!Pflanzenschutz,2,FALSE))","v":0},{"$f":"IF(AF98=\"\",0,VLOOKUP(AF98,PSMListe!Pflanzenschutz,2,FALSE))","v":0},{"$f":"IF(AG98=\"\",0,VLOOKUP(AG98,PSMListe!Pflanzenschutz,2,FALSE))","v":0},{"$f":"IF(AH98=\"\",0,VLOOKUP(AH98,PSMListe!Pflanzenschutz,2,FALSE))","v":0},{"$f":"IF(AI98=\"\",0,VLOOKUP(AI98,PSMListe!Pflanzenschutz,2,FALSE))","v":0},{"$f":"IF(AJ98=\"\",0,VLOOKUP(AJ98,PSMListe!Pflanzenschutz,2,FALSE))","v":0},{"$f":"IF(AK98=\"\",0,VLOOKUP(AK98,PSMListe!Pflanzenschutz,2,FALSE))","v":0},{"$f":"IF(AL98=\"\",0,VLOOKUP(AL98,PSMListe!Pflanzenschutz,2,FALSE))","v":0},{"$f":"IF(AM98=\"\",0,VLOOKUP(AM98,PSMListe!Pflanzenschutz,2,FALSE))","v":0},{"$f":"IF(AN98=\"\",0,VLOOKUP(AN98,PSMListe!Pflanzenschutz,2,FALSE))","v":0},{"$f":"IF(AO98=\"\",0,VLOOKUP(AO98,PSMListe!Pflanzenschutz,2,FALSE))","v":0},{"$f":"IF(AP98=\"\",0,VLOOKUP(AP98,PSMListe!Pflanzenschutz,2,FALSE))","v":0},{"$f":"IF(AQ98=\"\",0,VLOOKUP(AQ98,PSMListe!Pflanzenschutz,2,FALSE))","v":0},{"$f":"IF(AR98=\"\",0,VLOOKUP(AR98,PSMListe!Pflanzenschutz,2,FALSE))","v":0},{"$f":"IF(AS98=\"\",0,VLOOKUP(AS98,PSMListe!Pflanzenschutz,2,FALSE))","v":0},{"$f":"IF(AT98=\"\",0,VLOOKUP(AT98,PSMListe!Pflanzenschutz,2,FALSE))","v":0},{"$f":"IF(AU98=\"\",0,VLOOKUP(AU98,PSMListe!Pflanzenschutz,2,FALSE))","v":0},{"$f":"IF(AV98=\"\",0,VLOOKUP(AV98,PSMListe!Pflanzenschutz,2,FALSE))","v":0},{"$f":"IF(AW98=\"\",0,VLOOKUP(AW98,PSMListe!Pflanzenschutz,2,FALSE))","v":0},{"$f":"IF(AX98=\"\",0,VLOOKUP(AX98,PSMListe!Pflanzenschutz,2,FALSE))","v":0},{"$f":"IF(AY98=\"\",0,VLOOKUP(AY98,PSMListe!Pflanzenschutz,2,FALSE))","v":0},{"$f":"IF(AZ98=\"\",0,VLOOKUP(AZ98,PSMListe!Pflanzenschutz,2,FALSE))","v":0},{"$f":"IF(BA98=\"\",0,VLOOKUP(BA98,PSMListe!Pflanzenschutz,2,FALSE))","v":0},{"$f":"IF(BB98=\"\",0,VLOOKUP(BB98,PSMListe!Pflanzenschutz,2,FALSE))","v":0},{"$f":"IF(BC98=\"\",0,VLOOKUP(BC98,PSMListe!Pflanzenschutz,2,FALSE))","v":0},{"$f":"IF(BD98=\"\",0,VLOOKUP(BD98,PSMListe!Pflanzenschutz,2,FALSE))","v":0},{"$f":"IF(BE98=\"\",0,VLOOKUP(BE98,PSMListe!Pflanzenschutz,2,FALSE))","v":0},{"$f":"IF(BF98=\"\",0,VLOOKUP(BF98,PSMListe!Pflanzenschutz,2,FALSE))","v":0},{"$f":"IF(BG98=\"\",0,VLOOKUP(BG98,PSMListe!Pflanzenschutz,2,FALSE))","v":0},{"$f":"IF(BH98=\"\",0,VLOOKUP(BH98,PSMListe!Pflanzenschutz,2,FALSE))","v":0},{"$f":"IF(BI98=\"\",0,VLOOKUP(BI98,PSMListe!Pflanzenschutz,2,FALSE))","v":0},{"$f":"IF(BJ98=\"\",0,VLOOKUP(BJ98,PSMListe!Pflanzenschutz,2,FALSE))","v":0}]
[null,"Menge"]
[null,"Bemerkung"]
[null,"Datum"]
[null,"Mittel 20"]
[null,"Preis",{"$f":"IF(C103=\"\",0,VLOOKUP(C103,PSMListe!Pflanzenschutz,2,FALSE))","v":0},{"$f":"IF(D103=\"\",0,VLOOKUP(D103,PSMListe!Pflanzenschutz,2,FALSE))","v":0},{"$f":"IF(E103=\"\",0,VLOOKUP(E103,PSMListe!Pflanzenschutz,2,FALSE))","v":0},{"$f":"IF(F103=\"\",0,VLOOKUP(F103,PSMListe!Pflanzenschutz,2,FALSE))","v":0},{"$f":"IF(G103=\"\",0,VLOOKUP(G103,PSMListe!Pflanzenschutz,2,FALSE))","v":0},{"$f":"IF(H103=\"\",0,VLOOKUP(H103,PSMListe!Pflanzenschutz,2,FALSE))","v":0},{"$f":"IF(I103=\"\",0,VLOOKUP(I103,PSMListe!Pflanzenschutz,2,FALSE))","v":0},{"$f":"IF(J103=\"\",0,VLOOKUP(J103,PSMListe!Pflanzenschutz,2,FALSE))","v":0},{"$f":"IF(K103=\"\",0,VLOOKUP(K103,PSMListe!Pflanzenschutz,2,FALSE))","v":0},{"$f":"IF(L103=\"\",0,VLOOKUP(L103,PSMListe!Pflanzenschutz,2,FALSE))","v":0},{"$f":"IF(M103=\"\",0,VLOOKUP(M103,PSMListe!Pflanzenschutz,2,FALSE))","v":0},{"$f":"IF(N103=\"\",0,VLOOKUP(N103,PSMListe!Pflanzenschutz,2,FALSE))","v":0},{"$f":"IF(O103=\"\",0,VLOOKUP(O103,PSMListe!Pflanzenschutz,2,FALSE))","v":0},{"$f":"IF(P103=\"\",0,VLOOKUP(P103,PSMListe!Pflanzenschutz,2,FALSE))","v":0},{"$f":"IF(Q103=\"\",0,VLOOKUP(Q103,PSMListe!Pflanzenschutz,2,FALSE))","v":0},{"$f":"IF(R103=\"\",0,VLOOKUP(R103,PSMListe!Pflanzenschutz,2,FALSE))","v":0},{"$f":"IF(S103=\"\",0,VLOOKUP(S103,PSMListe!Pflanzenschutz,2,FALSE))","v":0},{"$f":"IF(T103=\"\",0,VLOOKUP(T103,PSMListe!Pflanzenschutz,2,FALSE))","v":0},{"$f":"IF(U103=\"\",0,VLOOKUP(U103,PSMListe!Pflanzenschutz,2,FALSE))","v":0},{"$f":"IF(V103=\"\",0,VLOOKUP(V103,PSMListe!Pflanzenschutz,2,FALSE))","v":0},{"$f":"IF(W103=\"\",0,VLOOKUP(W103,PSMListe!Pflanzenschutz,2,FALSE))","v":0},{"$f":"IF(X103=\"\",0,VLOOKUP(X103,PSMListe!Pflanzenschutz,2,FALSE))","v":0},{"$f":"IF(Y103=\"\",0,VLOOKUP(Y103,PSMListe!Pflanzenschutz,2,FALSE))","v":0},{"$f":"IF(Z103=\"\",0,VLOOKUP(Z103,PSMListe!Pflanzenschutz,2,FALSE))","v":0},{"$f":"IF(AA103=\"\",0,VLOOKUP(AA103,PSMListe!Pflanzenschutz,2,FALSE))","v":0},{"$f":"IF(AB103=\"\",0,VLOOKUP(AB103,PSMListe!Pflanzenschutz,2,FALSE))","v":0},{"$f":"IF(AC103=\"\",0,VLOOKUP(AC103,PSMListe!Pflanzenschutz,2,FALSE))","v":0},{"$f":"IF(AD103=\"\",0,VLOOKUP(AD103,PSMListe!Pflanzenschutz,2,FALSE))","v":0},{"$f":"IF(AE103=\"\",0,VLOOKUP(AE103,PSMListe!Pflanzenschutz,2,FALSE))","v":0},{"$f":"IF(AF103=\"\",0,VLOOKUP(AF103,PSMListe!Pflanzenschutz,2,FALSE))","v":0},{"$f":"IF(AG103=\"\",0,VLOOKUP(AG103,PSMListe!Pflanzenschutz,2,FALSE))","v":0},{"$f":"IF(AH103=\"\",0,VLOOKUP(AH103,PSMListe!Pflanzenschutz,2,FALSE))","v":0},{"$f":"IF(AI103=\"\",0,VLOOKUP(AI103,PSMListe!Pflanzenschutz,2,FALSE))","v":0},{"$f":"IF(AJ103=\"\",0,VLOOKUP(AJ103,PSMListe!Pflanzenschutz,2,FALSE))","v":0},{"$f":"IF(AK103=\"\",0,VLOOKUP(AK103,PSMListe!Pflanzenschutz,2,FALSE))","v":0},{"$f":"IF(AL103=\"\",0,VLOOKUP(AL103,PSMListe!Pflanzenschutz,2,FALSE))","v":0},{"$f":"IF(AM103=\"\",0,VLOOKUP(AM103,PSMListe!Pflanzenschutz,2,FALSE))","v":0},{"$f":"IF(AN103=\"\",0,VLOOKUP(AN103,PSMListe!Pflanzenschutz,2,FALSE))","v":0},{"$f":"IF(AO103=\"\",0,VLOOKUP(AO103,PSMListe!Pflanzenschutz,2,FALSE))","v":0},{"$f":"IF(AP103=\"\",0,VLOOKUP(AP103,PSMListe!Pflanzenschutz,2,FALSE))","v":0},{"$f":"IF(AQ103=\"\",0,VLOOKUP(AQ103,PSMListe!Pflanzenschutz,2,FALSE))","v":0},{"$f":"IF(AR103=\"\",0,VLOOKUP(AR103,PSMListe!Pflanzenschutz,2,FALSE))","v":0},{"$f":"IF(AS103=\"\",0,VLOOKUP(AS103,PSMListe!Pflanzenschutz,2,FALSE))","v":0},{"$f":"IF(AT103=\"\",0,VLOOKUP(AT103,PSMListe!Pflanzenschutz,2,FALSE))","v":0},{"$f":"IF(AU103=\"\",0,VLOOKUP(AU103,PSMListe!Pflanzenschutz,2,FALSE))","v":0},{"$f":"IF(AV103=\"\",0,VLOOKUP(AV103,PSMListe!Pflanzenschutz,2,FALSE))","v":0},{"$f":"IF(AW103=\"\",0,VLOOKUP(AW103,PSMListe!Pflanzenschutz,2,FALSE))","v":0},{"$f":"IF(AX103=\"\",0,VLOOKUP(AX103,PSMListe!Pflanzenschutz,2,FALSE))","v":0},{"$f":"IF(AY103=\"\",0,VLOOKUP(AY103,PSMListe!Pflanzenschutz,2,FALSE))","v":0},{"$f":"IF(AZ103=\"\",0,VLOOKUP(AZ103,PSMListe!Pflanzenschutz,2,FALSE))","v":0},{"$f":"IF(BA103=\"\",0,VLOOKUP(BA103,PSMListe!Pflanzenschutz,2,FALSE))","v":0},{"$f":"IF(BB103=\"\",0,VLOOKUP(BB103,PSMListe!Pflanzenschutz,2,FALSE))","v":0},{"$f":"IF(BC103=\"\",0,VLOOKUP(BC103,PSMListe!Pflanzenschutz,2,FALSE))","v":0},{"$f":"IF(BD103=\"\",0,VLOOKUP(BD103,PSMListe!Pflanzenschutz,2,FALSE))","v":0},{"$f":"IF(BE103=\"\",0,VLOOKUP(BE103,PSMListe!Pflanzenschutz,2,FALSE))","v":0},{"$f":"IF(BF103=\"\",0,VLOOKUP(BF103,PSMListe!Pflanzenschutz,2,FALSE))","v":0},{"$f":"IF(BG103=\"\",0,VLOOKUP(BG103,PSMListe!Pflanzenschutz,2,FALSE))","v":0},{"$f":"IF(BH103=\"\",0,VLOOKUP(BH103,PSMListe!Pflanzenschutz,2,FALSE))","v":0},{"$f":"IF(BI103=\"\",0,VLOOKUP(BI103,PSMListe!Pflanzenschutz,2,FALSE))","v":0},{"$f":"IF(BJ103=\"\",0,VLOOKUP(BJ103,PSMListe!Pflanzenschutz,2,FALSE))","v":0}]
[null,"Menge"]
[null,"Bemerkung"]
[null,"Datum"]
[null,"Mittel 21"]
[null,"Preis",{"$f":"IF(C108=\"\",0,VLOOKUP(C108,PSMListe!Pflanzenschutz,2,FALSE))","v":0},{"$f":"IF(D108=\"\",0,VLOOKUP(D108,PSMListe!Pflanzenschutz,2,FALSE))","v":0},{"$f":"IF(E108=\"\",0,VLOOKUP(E108,PSMListe!Pflanzenschutz,2,FALSE))","v":0},{"$f":"IF(F108=\"\",0,VLOOKUP(F108,PSMListe!Pflanzenschutz,2,FALSE))","v":0},{"$f":"IF(G108=\"\",0,VLOOKUP(G108,PSMListe!Pflanzenschutz,2,FALSE))","v":0},{"$f":"IF(H108=\"\",0,VLOOKUP(H108,PSMListe!Pflanzenschutz,2,FALSE))","v":0},{"$f":"IF(I108=\"\",0,VLOOKUP(I108,PSMListe!Pflanzenschutz,2,FALSE))","v":0},{"$f":"IF(J108=\"\",0,VLOOKUP(J108,PSMListe!Pflanzenschutz,2,FALSE))","v":0},{"$f":"IF(K108=\"\",0,VLOOKUP(K108,PSMListe!Pflanzenschutz,2,FALSE))","v":0},{"$f":"IF(L108=\"\",0,VLOOKUP(L108,PSMListe!Pflanzenschutz,2,FALSE))","v":0},{"$f":"IF(M108=\"\",0,VLOOKUP(M108,PSMListe!Pflanzenschutz,2,FALSE))","v":0},{"$f":"IF(N108=\"\",0,VLOOKUP(N108,PSMListe!Pflanzenschutz,2,FALSE))","v":0},{"$f":"IF(O108=\"\",0,VLOOKUP(O108,PSMListe!Pflanzenschutz,2,FALSE))","v":0},{"$f":"IF(P108=\"\",0,VLOOKUP(P108,PSMListe!Pflanzenschutz,2,FALSE))","v":0},{"$f":"IF(Q108=\"\",0,VLOOKUP(Q108,PSMListe!Pflanzenschutz,2,FALSE))","v":0},{"$f":"IF(R108=\"\",0,VLOOKUP(R108,PSMListe!Pflanzenschutz,2,FALSE))","v":0},{"$f":"IF(S108=\"\",0,VLOOKUP(S108,PSMListe!Pflanzenschutz,2,FALSE))","v":0},{"$f":"IF(T108=\"\",0,VLOOKUP(T108,PSMListe!Pflanzenschutz,2,FALSE))","v":0},{"$f":"IF(U108=\"\",0,VLOOKUP(U108,PSMListe!Pflanzenschutz,2,FALSE))","v":0},{"$f":"IF(V108=\"\",0,VLOOKUP(V108,PSMListe!Pflanzenschutz,2,FALSE))","v":0},{"$f":"IF(W108=\"\",0,VLOOKUP(W108,PSMListe!Pflanzenschutz,2,FALSE))","v":0},{"$f":"IF(X108=\"\",0,VLOOKUP(X108,PSMListe!Pflanzenschutz,2,FALSE))","v":0},{"$f":"IF(Y108=\"\",0,VLOOKUP(Y108,PSMListe!Pflanzenschutz,2,FALSE))","v":0},{"$f":"IF(Z108=\"\",0,VLOOKUP(Z108,PSMListe!Pflanzenschutz,2,FALSE))","v":0},{"$f":"IF(AA108=\"\",0,VLOOKUP(AA108,PSMListe!Pflanzenschutz,2,FALSE))","v":0},{"$f":"IF(AB108=\"\",0,VLOOKUP(AB108,PSMListe!Pflanzenschutz,2,FALSE))","v":0},{"$f":"IF(AC108=\"\",0,VLOOKUP(AC108,PSMListe!Pflanzenschutz,2,FALSE))","v":0},{"$f":"IF(AD108=\"\",0,VLOOKUP(AD108,PSMListe!Pflanzenschutz,2,FALSE))","v":0},{"$f":"IF(AE108=\"\",0,VLOOKUP(AE108,PSMListe!Pflanzenschutz,2,FALSE))","v":0},{"$f":"IF(AF108=\"\",0,VLOOKUP(AF108,PSMListe!Pflanzenschutz,2,FALSE))","v":0},{"$f":"IF(AG108=\"\",0,VLOOKUP(AG108,PSMListe!Pflanzenschutz,2,FALSE))","v":0},{"$f":"IF(AH108=\"\",0,VLOOKUP(AH108,PSMListe!Pflanzenschutz,2,FALSE))","v":0},{"$f":"IF(AI108=\"\",0,VLOOKUP(AI108,PSMListe!Pflanzenschutz,2,FALSE))","v":0},{"$f":"IF(AJ108=\"\",0,VLOOKUP(AJ108,PSMListe!Pflanzenschutz,2,FALSE))","v":0},{"$f":"IF(AK108=\"\",0,VLOOKUP(AK108,PSMListe!Pflanzenschutz,2,FALSE))","v":0},{"$f":"IF(AL108=\"\",0,VLOOKUP(AL108,PSMListe!Pflanzenschutz,2,FALSE))","v":0},{"$f":"IF(AM108=\"\",0,VLOOKUP(AM108,PSMListe!Pflanzenschutz,2,FALSE))","v":0},{"$f":"IF(AN108=\"\",0,VLOOKUP(AN108,PSMListe!Pflanzenschutz,2,FALSE))","v":0},{"$f":"IF(AO108=\"\",0,VLOOKUP(AO108,PSMListe!Pflanzenschutz,2,FALSE))","v":0},{"$f":"IF(AP108=\"\",0,VLOOKUP(AP108,PSMListe!Pflanzenschutz,2,FALSE))","v":0},{"$f":"IF(AQ108=\"\",0,VLOOKUP(AQ108,PSMListe!Pflanzenschutz,2,FALSE))","v":0},{"$f":"IF(AR108=\"\",0,VLOOKUP(AR108,PSMListe!Pflanzenschutz,2,FALSE))","v":0},{"$f":"IF(AS108=\"\",0,VLOOKUP(AS108,PSMListe!Pflanzenschutz,2,FALSE))","v":0},{"$f":"IF(AT108=\"\",0,VLOOKUP(AT108,PSMListe!Pflanzenschutz,2,FALSE))","v":0},{"$f":"IF(AU108=\"\",0,VLOOKUP(AU108,PSMListe!Pflanzenschutz,2,FALSE))","v":0},{"$f":"IF(AV108=\"\",0,VLOOKUP(AV108,PSMListe!Pflanzenschutz,2,FALSE))","v":0},{"$f":"IF(AW108=\"\",0,VLOOKUP(AW108,PSMListe!Pflanzenschutz,2,FALSE))","v":0},{"$f":"IF(AX108=\"\",0,VLOOKUP(AX108,PSMListe!Pflanzenschutz,2,FALSE))","v":0},{"$f":"IF(AY108=\"\",0,VLOOKUP(AY108,PSMListe!Pflanzenschutz,2,FALSE))","v":0},{"$f":"IF(AZ108=\"\",0,VLOOKUP(AZ108,PSMListe!Pflanzenschutz,2,FALSE))","v":0},{"$f":"IF(BA108=\"\",0,VLOOKUP(BA108,PSMListe!Pflanzenschutz,2,FALSE))","v":0},{"$f":"IF(BB108=\"\",0,VLOOKUP(BB108,PSMListe!Pflanzenschutz,2,FALSE))","v":0},{"$f":"IF(BC108=\"\",0,VLOOKUP(BC108,PSMListe!Pflanzenschutz,2,FALSE))","v":0},{"$f":"IF(BD108=\"\",0,VLOOKUP(BD108,PSMListe!Pflanzenschutz,2,FALSE))","v":0},{"$f":"IF(BE108=\"\",0,VLOOKUP(BE108,PSMListe!Pflanzenschutz,2,FALSE))","v":0},{"$f":"IF(BF108=\"\",0,VLOOKUP(BF108,PSMListe!Pflanzenschutz,2,FALSE))","v":0},{"$f":"IF(BG108=\"\",0,VLOOKUP(BG108,PSMListe!Pflanzenschutz,2,FALSE))","v":0},{"$f":"IF(BH108=\"\",0,VLOOKUP(BH108,PSMListe!Pflanzenschutz,2,FALSE))","v":0},{"$f":"IF(BI108=\"\",0,VLOOKUP(BI108,PSMListe!Pflanzenschutz,2,FALSE))","v":0},{"$f":"IF(BJ108=\"\",0,VLOOKUP(BJ108,PSMListe!Pflanzenschutz,2,FALSE))","v":0}]
[null,"Menge"]
[null,"Bemerkung"]
[null,"Datum"]
[null,"Mittel 22"]
[null,"Preis",{"$f":"IF(C113=\"\",0,VLOOKUP(C113,PSMListe!Pflanzenschutz,2,FALSE))","v":0},{"$f":"IF(D113=\"\",0,VLOOKUP(D113,PSMListe!Pflanzenschutz,2,FALSE))","v":0},{"$f":"IF(E113=\"\",0,VLOOKUP(E113,PSMListe!Pflanzenschutz,2,FALSE))","v":0},{"$f":"IF(F113=\"\",0,VLOOKUP(F113,PSMListe!Pflanzenschutz,2,FALSE))","v":0},{"$f":"IF(G113=\"\",0,VLOOKUP(G113,PSMListe!Pflanzenschutz,2,FALSE))","v":0},{"$f":"IF(H113=\"\",0,VLOOKUP(H113,PSMListe!Pflanzenschutz,2,FALSE))","v":0},{"$f":"IF(I113=\"\",0,VLOOKUP(I113,PSMListe!Pflanzenschutz,2,FALSE))","v":0},{"$f":"IF(J113=\"\",0,VLOOKUP(J113,PSMListe!Pflanzenschutz,2,FALSE))","v":0},{"$f":"IF(K113=\"\",0,VLOOKUP(K113,PSMListe!Pflanzenschutz,2,FALSE))","v":0},{"$f":"IF(L113=\"\",0,VLOOKUP(L113,PSMListe!Pflanzenschutz,2,FALSE))","v":0},{"$f":"IF(M113=\"\",0,VLOOKUP(M113,PSMListe!Pflanzenschutz,2,FALSE))","v":0},{"$f":"IF(N113=\"\",0,VLOOKUP(N113,PSMListe!Pflanzenschutz,2,FALSE))","v":0},{"$f":"IF(O113=\"\",0,VLOOKUP(O113,PSMListe!Pflanzenschutz,2,FALSE))","v":0},{"$f":"IF(P113=\"\",0,VLOOKUP(P113,PSMListe!Pflanzenschutz,2,FALSE))","v":0},{"$f":"IF(Q113=\"\",0,VLOOKUP(Q113,PSMListe!Pflanzenschutz,2,FALSE))","v":0},{"$f":"IF(R113=\"\",0,VLOOKUP(R113,PSMListe!Pflanzenschutz,2,FALSE))","v":0},{"$f":"IF(S113=\"\",0,VLOOKUP(S113,PSMListe!Pflanzenschutz,2,FALSE))","v":0},{"$f":"IF(T113=\"\",0,VLOOKUP(T113,PSMListe!Pflanzenschutz,2,FALSE))","v":0},{"$f":"IF(U113=\"\",0,VLOOKUP(U113,PSMListe!Pflanzenschutz,2,FALSE))","v":0},{"$f":"IF(V113=\"\",0,VLOOKUP(V113,PSMListe!Pflanzenschutz,2,FALSE))","v":0},{"$f":"IF(W113=\"\",0,VLOOKUP(W113,PSMListe!Pflanzenschutz,2,FALSE))","v":0},{"$f":"IF(X113=\"\",0,VLOOKUP(X113,PSMListe!Pflanzenschutz,2,FALSE))","v":0},{"$f":"IF(Y113=\"\",0,VLOOKUP(Y113,PSMListe!Pflanzenschutz,2,FALSE))","v":0},{"$f":"IF(Z113=\"\",0,VLOOKUP(Z113,PSMListe!Pflanzenschutz,2,FALSE))","v":0},{"$f":"IF(AA113=\"\",0,VLOOKUP(AA113,PSMListe!Pflanzenschutz,2,FALSE))","v":0},{"$f":"IF(AB113=\"\",0,VLOOKUP(AB113,PSMListe!Pflanzenschutz,2,FALSE))","v":0},{"$f":"IF(AC113=\"\",0,VLOOKUP(AC113,PSMListe!Pflanzenschutz,2,FALSE))","v":0},{"$f":"IF(AD113=\"\",0,VLOOKUP(AD113,PSMListe!Pflanzenschutz,2,FALSE))","v":0},{"$f":"IF(AE113=\"\",0,VLOOKUP(AE113,PSMListe!Pflanzenschutz,2,FALSE))","v":0},{"$f":"IF(AF113=\"\",0,VLOOKUP(AF113,PSMListe!Pflanzenschutz,2,FALSE))","v":0},{"$f":"IF(AG113=\"\",0,VLOOKUP(AG113,PSMListe!Pflanzenschutz,2,FALSE))","v":0},{"$f":"IF(AH113=\"\",0,VLOOKUP(AH113,PSMListe!Pflanzenschutz,2,FALSE))","v":0},{"$f":"IF(AI113=\"\",0,VLOOKUP(AI113,PSMListe!Pflanzenschutz,2,FALSE))","v":0},{"$f":"IF(AJ113=\"\",0,VLOOKUP(AJ113,PSMListe!Pflanzenschutz,2,FALSE))","v":0},{"$f":"IF(AK113=\"\",0,VLOOKUP(AK113,PSMListe!Pflanzenschutz,2,FALSE))","v":0},{"$f":"IF(AL113=\"\",0,VLOOKUP(AL113,PSMListe!Pflanzenschutz,2,FALSE))","v":0},{"$f":"IF(AM113=\"\",0,VLOOKUP(AM113,PSMListe!Pflanzenschutz,2,FALSE))","v":0},{"$f":"IF(AN113=\"\",0,VLOOKUP(AN113,PSMListe!Pflanzenschutz,2,FALSE))","v":0},{"$f":"IF(AO113=\"\",0,VLOOKUP(AO113,PSMListe!Pflanzenschutz,2,FALSE))","v":0},{"$f":"IF(AP113=\"\",0,VLOOKUP(AP113,PSMListe!Pflanzenschutz,2,FALSE))","v":0},{"$f":"IF(AQ113=\"\",0,VLOOKUP(AQ113,PSMListe!Pflanzenschutz,2,FALSE))","v":0},{"$f":"IF(AR113=\"\",0,VLOOKUP(AR113,PSMListe!Pflanzenschutz,2,FALSE))","v":0},{"$f":"IF(AS113=\"\",0,VLOOKUP(AS113,PSMListe!Pflanzenschutz,2,FALSE))","v":0},{"$f":"IF(AT113=\"\",0,VLOOKUP(AT113,PSMListe!Pflanzenschutz,2,FALSE))","v":0},{"$f":"IF(AU113=\"\",0,VLOOKUP(AU113,PSMListe!Pflanzenschutz,2,FALSE))","v":0},{"$f":"IF(AV113=\"\",0,VLOOKUP(AV113,PSMListe!Pflanzenschutz,2,FALSE))","v":0},{"$f":"IF(AW113=\"\",0,VLOOKUP(AW113,PSMListe!Pflanzenschutz,2,FALSE))","v":0},{"$f":"IF(AX113=\"\",0,VLOOKUP(AX113,PSMListe!Pflanzenschutz,2,FALSE))","v":0},{"$f":"IF(AY113=\"\",0,VLOOKUP(AY113,PSMListe!Pflanzenschutz,2,FALSE))","v":0},{"$f":"IF(AZ113=\"\",0,VLOOKUP(AZ113,PSMListe!Pflanzenschutz,2,FALSE))","v":0},{"$f":"IF(BA113=\"\",0,VLOOKUP(BA113,PSMListe!Pflanzenschutz,2,FALSE))","v":0},{"$f":"IF(BB113=\"\",0,VLOOKUP(BB113,PSMListe!Pflanzenschutz,2,FALSE))","v":0},{"$f":"IF(BC113=\"\",0,VLOOKUP(BC113,PSMListe!Pflanzenschutz,2,FALSE))","v":0},{"$f":"IF(BD113=\"\",0,VLOOKUP(BD113,PSMListe!Pflanzenschutz,2,FALSE))","v":0},{"$f":"IF(BE113=\"\",0,VLOOKUP(BE113,PSMListe!Pflanzenschutz,2,FALSE))","v":0},{"$f":"IF(BF113=\"\",0,VLOOKUP(BF113,PSMListe!Pflanzenschutz,2,FALSE))","v":0},{"$f":"IF(BG113=\"\",0,VLOOKUP(BG113,PSMListe!Pflanzenschutz,2,FALSE))","v":0},{"$f":"IF(BH113=\"\",0,VLOOKUP(BH113,PSMListe!Pflanzenschutz,2,FALSE))","v":0},{"$f":"IF(BI113=\"\",0,VLOOKUP(BI113,PSMListe!Pflanzenschutz,2,FALSE))","v":0},{"$f":"IF(BJ113=\"\",0,VLOOKUP(BJ113,PSMListe!Pflanzenschutz,2,FALSE))","v":0}]
[null,"Menge"]
[null,"Bemerkung"]
[null,"Datum"]
[null,"Mittel 23"]
[null,"Preis",{"$f":"IF(C118=\"\",0,VLOOKUP(C118,PSMListe!Pflanzenschutz,2,FALSE))","v":0},{"$f":"IF(D118=\"\",0,VLOOKUP(D118,PSMListe!Pflanzenschutz,2,FALSE))","v":0},{"$f":"IF(E118=\"\",0,VLOOKUP(E118,PSMListe!Pflanzenschutz,2,FALSE))","v":0},{"$f":"IF(F118=\"\",0,VLOOKUP(F118,PSMListe!Pflanzenschutz,2,FALSE))","v":0},{"$f":"IF(G118=\"\",0,VLOOKUP(G118,PSMListe!Pflanzenschutz,2,FALSE))","v":0},{"$f":"IF(H118=\"\",0,VLOOKUP(H118,PSMListe!Pflanzenschutz,2,FALSE))","v":0},{"$f":"IF(I118=\"\",0,VLOOKUP(I118,PSMListe!Pflanzenschutz,2,FALSE))","v":0},{"$f":"IF(J118=\"\",0,VLOOKUP(J118,PSMListe!Pflanzenschutz,2,FALSE))","v":0},{"$f":"IF(K118=\"\",0,VLOOKUP(K118,PSMListe!Pflanzenschutz,2,FALSE))","v":0},{"$f":"IF(L118=\"\",0,VLOOKUP(L118,PSMListe!Pflanzenschutz,2,FALSE))","v":0},{"$f":"IF(M118=\"\",0,VLOOKUP(M118,PSMListe!Pflanzenschutz,2,FALSE))","v":0},{"$f":"IF(N118=\"\",0,VLOOKUP(N118,PSMListe!Pflanzenschutz,2,FALSE))","v":0},{"$f":"IF(O118=\"\",0,VLOOKUP(O118,PSMListe!Pflanzenschutz,2,FALSE))","v":0},{"$f":"IF(P118=\"\",0,VLOOKUP(P118,PSMListe!Pflanzenschutz,2,FALSE))","v":0},{"$f":"IF(Q118=\"\",0,VLOOKUP(Q118,PSMListe!Pflanzenschutz,2,FALSE))","v":0},{"$f":"IF(R118=\"\",0,VLOOKUP(R118,PSMListe!Pflanzenschutz,2,FALSE))","v":0},{"$f":"IF(S118=\"\",0,VLOOKUP(S118,PSMListe!Pflanzenschutz,2,FALSE))","v":0},{"$f":"IF(T118=\"\",0,VLOOKUP(T118,PSMListe!Pflanzenschutz,2,FALSE))","v":0},{"$f":"IF(U118=\"\",0,VLOOKUP(U118,PSMListe!Pflanzenschutz,2,FALSE))","v":0},{"$f":"IF(V118=\"\",0,VLOOKUP(V118,PSMListe!Pflanzenschutz,2,FALSE))","v":0},{"$f":"IF(W118=\"\",0,VLOOKUP(W118,PSMListe!Pflanzenschutz,2,FALSE))","v":0},{"$f":"IF(X118=\"\",0,VLOOKUP(X118,PSMListe!Pflanzenschutz,2,FALSE))","v":0},{"$f":"IF(Y118=\"\",0,VLOOKUP(Y118,PSMListe!Pflanzenschutz,2,FALSE))","v":0},{"$f":"IF(Z118=\"\",0,VLOOKUP(Z118,PSMListe!Pflanzenschutz,2,FALSE))","v":0},{"$f":"IF(AA118=\"\",0,VLOOKUP(AA118,PSMListe!Pflanzenschutz,2,FALSE))","v":0},{"$f":"IF(AB118=\"\",0,VLOOKUP(AB118,PSMListe!Pflanzenschutz,2,FALSE))","v":0},{"$f":"IF(AC118=\"\",0,VLOOKUP(AC118,PSMListe!Pflanzenschutz,2,FALSE))","v":0},{"$f":"IF(AD118=\"\",0,VLOOKUP(AD118,PSMListe!Pflanzenschutz,2,FALSE))","v":0},{"$f":"IF(AE118=\"\",0,VLOOKUP(AE118,PSMListe!Pflanzenschutz,2,FALSE))","v":0},{"$f":"IF(AF118=\"\",0,VLOOKUP(AF118,PSMListe!Pflanzenschutz,2,FALSE))","v":0},{"$f":"IF(AG118=\"\",0,VLOOKUP(AG118,PSMListe!Pflanzenschutz,2,FALSE))","v":0},{"$f":"IF(AH118=\"\",0,VLOOKUP(AH118,PSMListe!Pflanzenschutz,2,FALSE))","v":0},{"$f":"IF(AI118=\"\",0,VLOOKUP(AI118,PSMListe!Pflanzenschutz,2,FALSE))","v":0},{"$f":"IF(AJ118=\"\",0,VLOOKUP(AJ118,PSMListe!Pflanzenschutz,2,FALSE))","v":0},{"$f":"IF(AK118=\"\",0,VLOOKUP(AK118,PSMListe!Pflanzenschutz,2,FALSE))","v":0},{"$f":"IF(AL118=\"\",0,VLOOKUP(AL118,PSMListe!Pflanzenschutz,2,FALSE))","v":0},{"$f":"IF(AM118=\"\",0,VLOOKUP(AM118,PSMListe!Pflanzenschutz,2,FALSE))","v":0},{"$f":"IF(AN118=\"\",0,VLOOKUP(AN118,PSMListe!Pflanzenschutz,2,FALSE))","v":0},{"$f":"IF(AO118=\"\",0,VLOOKUP(AO118,PSMListe!Pflanzenschutz,2,FALSE))","v":0},{"$f":"IF(AP118=\"\",0,VLOOKUP(AP118,PSMListe!Pflanzenschutz,2,FALSE))","v":0},{"$f":"IF(AQ118=\"\",0,VLOOKUP(AQ118,PSMListe!Pflanzenschutz,2,FALSE))","v":0},{"$f":"IF(AR118=\"\",0,VLOOKUP(AR118,PSMListe!Pflanzenschutz,2,FALSE))","v":0},{"$f":"IF(AS118=\"\",0,VLOOKUP(AS118,PSMListe!Pflanzenschutz,2,FALSE))","v":0},{"$f":"IF(AT118=\"\",0,VLOOKUP(AT118,PSMListe!Pflanzenschutz,2,FALSE))","v":0},{"$f":"IF(AU118=\"\",0,VLOOKUP(AU118,PSMListe!Pflanzenschutz,2,FALSE))","v":0},{"$f":"IF(AV118=\"\",0,VLOOKUP(AV118,PSMListe!Pflanzenschutz,2,FALSE))","v":0},{"$f":"IF(AW118=\"\",0,VLOOKUP(AW118,PSMListe!Pflanzenschutz,2,FALSE))","v":0},{"$f":"IF(AX118=\"\",0,VLOOKUP(AX118,PSMListe!Pflanzenschutz,2,FALSE))","v":0},{"$f":"IF(AY118=\"\",0,VLOOKUP(AY118,PSMListe!Pflanzenschutz,2,FALSE))","v":0},{"$f":"IF(AZ118=\"\",0,VLOOKUP(AZ118,PSMListe!Pflanzenschutz,2,FALSE))","v":0},{"$f":"IF(BA118=\"\",0,VLOOKUP(BA118,PSMListe!Pflanzenschutz,2,FALSE))","v":0},{"$f":"IF(BB118=\"\",0,VLOOKUP(BB118,PSMListe!Pflanzenschutz,2,FALSE))","v":0},{"$f":"IF(BC118=\"\",0,VLOOKUP(BC118,PSMListe!Pflanzenschutz,2,FALSE))","v":0},{"$f":"IF(BD118=\"\",0,VLOOKUP(BD118,PSMListe!Pflanzenschutz,2,FALSE))","v":0},{"$f":"IF(BE118=\"\",0,VLOOKUP(BE118,PSMListe!Pflanzenschutz,2,FALSE))","v":0},{"$f":"IF(BF118=\"\",0,VLOOKUP(BF118,PSMListe!Pflanzenschutz,2,FALSE))","v":0},{"$f":"IF(BG118=\"\",0,VLOOKUP(BG118,PSMListe!Pflanzenschutz,2,FALSE))","v":0},{"$f":"IF(BH118=\"\",0,VLOOKUP(BH118,PSMListe!Pflanzenschutz,2,FALSE))","v":0},{"$f":"IF(BI118=\"\",0,VLOOKUP(BI118,PSMListe!Pflanzenschutz,2,FALSE))","v":0},{"$f":"IF(BJ118=\"\",0,VLOOKUP(BJ118,PSMListe!Pflanzenschutz,2,FALSE))","v":0}]
[null,"Menge"]
[null,"Bemerkung"]
[null,"Datum"]
[null,"Mittel 24"]
[null,"Preis",{"$f":"IF(C123=\"\",0,VLOOKUP(C123,PSMListe!Pflanzenschutz,2,FALSE))","v":0},{"$f":"IF(D123=\"\",0,VLOOKUP(D123,PSMListe!Pflanzenschutz,2,FALSE))","v":0},{"$f":"IF(E123=\"\",0,VLOOKUP(E123,PSMListe!Pflanzenschutz,2,FALSE))","v":0},{"$f":"IF(F123=\"\",0,VLOOKUP(F123,PSMListe!Pflanzenschutz,2,FALSE))","v":0},{"$f":"IF(G123=\"\",0,VLOOKUP(G123,PSMListe!Pflanzenschutz,2,FALSE))","v":0},{"$f":"IF(H123=\"\",0,VLOOKUP(H123,PSMListe!Pflanzenschutz,2,FALSE))","v":0},{"$f":"IF(I123=\"\",0,VLOOKUP(I123,PSMListe!Pflanzenschutz,2,FALSE))","v":0},{"$f":"IF(J123=\"\",0,VLOOKUP(J123,PSMListe!Pflanzenschutz,2,FALSE))","v":0},{"$f":"IF(K123=\"\",0,VLOOKUP(K123,PSMListe!Pflanzenschutz,2,FALSE))","v":0},{"$f":"IF(L123=\"\",0,VLOOKUP(L123,PSMListe!Pflanzenschutz,2,FALSE))","v":0},{"$f":"IF(M123=\"\",0,VLOOKUP(M123,PSMListe!Pflanzenschutz,2,FALSE))","v":0},{"$f":"IF(N123=\"\",0,VLOOKUP(N123,PSMListe!Pflanzenschutz,2,FALSE))","v":0},{"$f":"IF(O123=\"\",0,VLOOKUP(O123,PSMListe!Pflanzenschutz,2,FALSE))","v":0},{"$f":"IF(P123=\"\",0,VLOOKUP(P123,PSMListe!Pflanzenschutz,2,FALSE))","v":0},{"$f":"IF(Q123=\"\",0,VLOOKUP(Q123,PSMListe!Pflanzenschutz,2,FALSE))","v":0},{"$f":"IF(R123=\"\",0,VLOOKUP(R123,PSMListe!Pflanzenschutz,2,FALSE))","v":0},{"$f":"IF(S123=\"\",0,VLOOKUP(S123,PSMListe!Pflanzenschutz,2,FALSE))","v":0},{"$f":"IF(T123=\"\",0,VLOOKUP(T123,PSMListe!Pflanzenschutz,2,FALSE))","v":0},{"$f":"IF(U123=\"\",0,VLOOKUP(U123,PSMListe!Pflanzenschutz,2,FALSE))","v":0},{"$f":"IF(V123=\"\",0,VLOOKUP(V123,PSMListe!Pflanzenschutz,2,FALSE))","v":0},{"$f":"IF(W123=\"\",0,VLOOKUP(W123,PSMListe!Pflanzenschutz,2,FALSE))","v":0},{"$f":"IF(X123=\"\",0,VLOOKUP(X123,PSMListe!Pflanzenschutz,2,FALSE))","v":0},{"$f":"IF(Y123=\"\",0,VLOOKUP(Y123,PSMListe!Pflanzenschutz,2,FALSE))","v":0},{"$f":"IF(Z123=\"\",0,VLOOKUP(Z123,PSMListe!Pflanzenschutz,2,FALSE))","v":0},{"$f":"IF(AA123=\"\",0,VLOOKUP(AA123,PSMListe!Pflanzenschutz,2,FALSE))","v":0},{"$f":"IF(AB123=\"\",0,VLOOKUP(AB123,PSMListe!Pflanzenschutz,2,FALSE))","v":0},{"$f":"IF(AC123=\"\",0,VLOOKUP(AC123,PSMListe!Pflanzenschutz,2,FALSE))","v":0},{"$f":"IF(AD123=\"\",0,VLOOKUP(AD123,PSMListe!Pflanzenschutz,2,FALSE))","v":0},{"$f":"IF(AE123=\"\",0,VLOOKUP(AE123,PSMListe!Pflanzenschutz,2,FALSE))","v":0},{"$f":"IF(AF123=\"\",0,VLOOKUP(AF123,PSMListe!Pflanzenschutz,2,FALSE))","v":0},{"$f":"IF(AG123=\"\",0,VLOOKUP(AG123,PSMListe!Pflanzenschutz,2,FALSE))","v":0},{"$f":"IF(AH123=\"\",0,VLOOKUP(AH123,PSMListe!Pflanzenschutz,2,FALSE))","v":0},{"$f":"IF(AI123=\"\",0,VLOOKUP(AI123,PSMListe!Pflanzenschutz,2,FALSE))","v":0},{"$f":"IF(AJ123=\"\",0,VLOOKUP(AJ123,PSMListe!Pflanzenschutz,2,FALSE))","v":0},{"$f":"IF(AK123=\"\",0,VLOOKUP(AK123,PSMListe!Pflanzenschutz,2,FALSE))","v":0},{"$f":"IF(AL123=\"\",0,VLOOKUP(AL123,PSMListe!Pflanzenschutz,2,FALSE))","v":0},{"$f":"IF(AM123=\"\",0,VLOOKUP(AM123,PSMListe!Pflanzenschutz,2,FALSE))","v":0},{"$f":"IF(AN123=\"\",0,VLOOKUP(AN123,PSMListe!Pflanzenschutz,2,FALSE))","v":0},{"$f":"IF(AO123=\"\",0,VLOOKUP(AO123,PSMListe!Pflanzenschutz,2,FALSE))","v":0},{"$f":"IF(AP123=\"\",0,VLOOKUP(AP123,PSMListe!Pflanzenschutz,2,FALSE))","v":0},{"$f":"IF(AQ123=\"\",0,VLOOKUP(AQ123,PSMListe!Pflanzenschutz,2,FALSE))","v":0},{"$f":"IF(AR123=\"\",0,VLOOKUP(AR123,PSMListe!Pflanzenschutz,2,FALSE))","v":0},{"$f":"IF(AS123=\"\",0,VLOOKUP(AS123,PSMListe!Pflanzenschutz,2,FALSE))","v":0},{"$f":"IF(AT123=\"\",0,VLOOKUP(AT123,PSMListe!Pflanzenschutz,2,FALSE))","v":0},{"$f":"IF(AU123=\"\",0,VLOOKUP(AU123,PSMListe!Pflanzenschutz,2,FALSE))","v":0},{"$f":"IF(AV123=\"\",0,VLOOKUP(AV123,PSMListe!Pflanzenschutz,2,FALSE))","v":0},{"$f":"IF(AW123=\"\",0,VLOOKUP(AW123,PSMListe!Pflanzenschutz,2,FALSE))","v":0},{"$f":"IF(AX123=\"\",0,VLOOKUP(AX123,PSMListe!Pflanzenschutz,2,FALSE))","v":0},{"$f":"IF(AY123=\"\",0,VLOOKUP(AY123,PSMListe!Pflanzenschutz,2,FALSE))","v":0},{"$f":"IF(AZ123=\"\",0,VLOOKUP(AZ123,PSMListe!Pflanzenschutz,2,FALSE))","v":0},{"$f":"IF(BA123=\"\",0,VLOOKUP(BA123,PSMListe!Pflanzenschutz,2,FALSE))","v":0},{"$f":"IF(BB123=\"\",0,VLOOKUP(BB123,PSMListe!Pflanzenschutz,2,FALSE))","v":0},{"$f":"IF(BC123=\"\",0,VLOOKUP(BC123,PSMListe!Pflanzenschutz,2,FALSE))","v":0},{"$f":"IF(BD123=\"\",0,VLOOKUP(BD123,PSMListe!Pflanzenschutz,2,FALSE))","v":0},{"$f":"IF(BE123=\"\",0,VLOOKUP(BE123,PSMListe!Pflanzenschutz,2,FALSE))","v":0},{"$f":"IF(BF123=\"\",0,VLOOKUP(BF123,PSMListe!Pflanzenschutz,2,FALSE))","v":0},{"$f":"IF(BG123=\"\",0,VLOOKUP(BG123,PSMListe!Pflanzenschutz,2,FALSE))","v":0},{"$f":"IF(BH123=\"\",0,VLOOKUP(BH123,PSMListe!Pflanzenschutz,2,FALSE))","v":0},{"$f":"IF(BI123=\"\",0,VLOOKUP(BI123,PSMListe!Pflanzenschutz,2,FALSE))","v":0},{"$f":"IF(BJ123=\"\",0,VLOOKUP(BJ123,PSMListe!Pflanzenschutz,2,FALSE))","v":0}]
[null,"Menge"]
[null,"Bemerkung"]
[null,"Datum"]
[null,"Mittel 25"]
[null,"Preis",{"$f":"IF(C128=\"\",0,VLOOKUP(C128,PSMListe!Pflanzenschutz,2,FALSE))","v":0},{"$f":"IF(D128=\"\",0,VLOOKUP(D128,PSMListe!Pflanzenschutz,2,FALSE))","v":0},{"$f":"IF(E128=\"\",0,VLOOKUP(E128,PSMListe!Pflanzenschutz,2,FALSE))","v":0},{"$f":"IF(F128=\"\",0,VLOOKUP(F128,PSMListe!Pflanzenschutz,2,FALSE))","v":0},{"$f":"IF(G128=\"\",0,VLOOKUP(G128,PSMListe!Pflanzenschutz,2,FALSE))","v":0},{"$f":"IF(H128=\"\",0,VLOOKUP(H128,PSMListe!Pflanzenschutz,2,FALSE))","v":0},{"$f":"IF(I128=\"\",0,VLOOKUP(I128,PSMListe!Pflanzenschutz,2,FALSE))","v":0},{"$f":"IF(J128=\"\",0,VLOOKUP(J128,PSMListe!Pflanzenschutz,2,FALSE))","v":0},{"$f":"IF(K128=\"\",0,VLOOKUP(K128,PSMListe!Pflanzenschutz,2,FALSE))","v":0},{"$f":"IF(L128=\"\",0,VLOOKUP(L128,PSMListe!Pflanzenschutz,2,FALSE))","v":0},{"$f":"IF(M128=\"\",0,VLOOKUP(M128,PSMListe!Pflanzenschutz,2,FALSE))","v":0},{"$f":"IF(N128=\"\",0,VLOOKUP(N128,PSMListe!Pflanzenschutz,2,FALSE))","v":0},{"$f":"IF(O128=\"\",0,VLOOKUP(O128,PSMListe!Pflanzenschutz,2,FALSE))","v":0},{"$f":"IF(P128=\"\",0,VLOOKUP(P128,PSMListe!Pflanzenschutz,2,FALSE))","v":0},{"$f":"IF(Q128=\"\",0,VLOOKUP(Q128,PSMListe!Pflanzenschutz,2,FALSE))","v":0},{"$f":"IF(R128=\"\",0,VLOOKUP(R128,PSMListe!Pflanzenschutz,2,FALSE))","v":0},{"$f":"IF(S128=\"\",0,VLOOKUP(S128,PSMListe!Pflanzenschutz,2,FALSE))","v":0},{"$f":"IF(T128=\"\",0,VLOOKUP(T128,PSMListe!Pflanzenschutz,2,FALSE))","v":0},{"$f":"IF(U128=\"\",0,VLOOKUP(U128,PSMListe!Pflanzenschutz,2,FALSE))","v":0},{"$f":"IF(V128=\"\",0,VLOOKUP(V128,PSMListe!Pflanzenschutz,2,FALSE))","v":0},{"$f":"IF(W128=\"\",0,VLOOKUP(W128,PSMListe!Pflanzenschutz,2,FALSE))","v":0},{"$f":"IF(X128=\"\",0,VLOOKUP(X128,PSMListe!Pflanzenschutz,2,FALSE))","v":0},{"$f":"IF(Y128=\"\",0,VLOOKUP(Y128,PSMListe!Pflanzenschutz,2,FALSE))","v":0},{"$f":"IF(Z128=\"\",0,VLOOKUP(Z128,PSMListe!Pflanzenschutz,2,FALSE))","v":0},{"$f":"IF(AA128=\"\",0,VLOOKUP(AA128,PSMListe!Pflanzenschutz,2,FALSE))","v":0},{"$f":"IF(AB128=\"\",0,VLOOKUP(AB128,PSMListe!Pflanzenschutz,2,FALSE))","v":0},{"$f":"IF(AC128=\"\",0,VLOOKUP(AC128,PSMListe!Pflanzenschutz,2,FALSE))","v":0},{"$f":"IF(AD128=\"\",0,VLOOKUP(AD128,PSMListe!Pflanzenschutz,2,FALSE))","v":0},{"$f":"IF(AE128=\"\",0,VLOOKUP(AE128,PSMListe!Pflanzenschutz,2,FALSE))","v":0},{"$f":"IF(AF128=\"\",0,VLOOKUP(AF128,PSMListe!Pflanzenschutz,2,FALSE))","v":0},{"$f":"IF(AG128=\"\",0,VLOOKUP(AG128,PSMListe!Pflanzenschutz,2,FALSE))","v":0},{"$f":"IF(AH128=\"\",0,VLOOKUP(AH128,PSMListe!Pflanzenschutz,2,FALSE))","v":0},{"$f":"IF(AI128=\"\",0,VLOOKUP(AI128,PSMListe!Pflanzenschutz,2,FALSE))","v":0},{"$f":"IF(AJ128=\"\",0,VLOOKUP(AJ128,PSMListe!Pflanzenschutz,2,FALSE))","v":0},{"$f":"IF(AK128=\"\",0,VLOOKUP(AK128,PSMListe!Pflanzenschutz,2,FALSE))","v":0},{"$f":"IF(AL128=\"\",0,VLOOKUP(AL128,PSMListe!Pflanzenschutz,2,FALSE))","v":0},{"$f":"IF(AM128=\"\",0,VLOOKUP(AM128,PSMListe!Pflanzenschutz,2,FALSE))","v":0},{"$f":"IF(AN128=\"\",0,VLOOKUP(AN128,PSMListe!Pflanzenschutz,2,FALSE))","v":0},{"$f":"IF(AO128=\"\",0,VLOOKUP(AO128,PSMListe!Pflanzenschutz,2,FALSE))","v":0},{"$f":"IF(AP128=\"\",0,VLOOKUP(AP128,PSMListe!Pflanzenschutz,2,FALSE))","v":0},{"$f":"IF(AQ128=\"\",0,VLOOKUP(AQ128,PSMListe!Pflanzenschutz,2,FALSE))","v":0},{"$f":"IF(AR128=\"\",0,VLOOKUP(AR128,PSMListe!Pflanzenschutz,2,FALSE))","v":0},{"$f":"IF(AS128=\"\",0,VLOOKUP(AS128,PSMListe!Pflanzenschutz,2,FALSE))","v":0},{"$f":"IF(AT128=\"\",0,VLOOKUP(AT128,PSMListe!Pflanzenschutz,2,FALSE))","v":0},{"$f":"IF(AU128=\"\",0,VLOOKUP(AU128,PSMListe!Pflanzenschutz,2,FALSE))","v":0},{"$f":"IF(AV128=\"\",0,VLOOKUP(AV128,PSMListe!Pflanzenschutz,2,FALSE))","v":0},{"$f":"IF(AW128=\"\",0,VLOOKUP(AW128,PSMListe!Pflanzenschutz,2,FALSE))","v":0},{"$f":"IF(AX128=\"\",0,VLOOKUP(AX128,PSMListe!Pflanzenschutz,2,FALSE))","v":0},{"$f":"IF(AY128=\"\",0,VLOOKUP(AY128,PSMListe!Pflanzenschutz,2,FALSE))","v":0},{"$f":"IF(AZ128=\"\",0,VLOOKUP(AZ128,PSMListe!Pflanzenschutz,2,FALSE))","v":0},{"$f":"IF(BA128=\"\",0,VLOOKUP(BA128,PSMListe!Pflanzenschutz,2,FALSE))","v":0},{"$f":"IF(BB128=\"\",0,VLOOKUP(BB128,PSMListe!Pflanzenschutz,2,FALSE))","v":0},{"$f":"IF(BC128=\"\",0,VLOOKUP(BC128,PSMListe!Pflanzenschutz,2,FALSE))","v":0},{"$f":"IF(BD128=\"\",0,VLOOKUP(BD128,PSMListe!Pflanzenschutz,2,FALSE))","v":0},{"$f":"IF(BE128=\"\",0,VLOOKUP(BE128,PSMListe!Pflanzenschutz,2,FALSE))","v":0},{"$f":"IF(BF128=\"\",0,VLOOKUP(BF128,PSMListe!Pflanzenschutz,2,FALSE))","v":0},{"$f":"IF(BG128=\"\",0,VLOOKUP(BG128,PSMListe!Pflanzenschutz,2,FALSE))","v":0},{"$f":"IF(BH128=\"\",0,VLOOKUP(BH128,PSMListe!Pflanzenschutz,2,FALSE))","v":0},{"$f":"IF(BI128=\"\",0,VLOOKUP(BI128,PSMListe!Pflanzenschutz,2,FALSE))","v":0},{"$f":"IF(BJ128=\"\",0,VLOOKUP(BJ128,PSMListe!Pflanzenschutz,2,FALSE))","v":0}]
[null,"Menge"]
[null,"Bemerkung"]
[null,"Datum"]
[null,"Mittel 26"]
[null,"Preis",{"$f":"IF(C133=\"\",0,VLOOKUP(C133,PSMListe!Pflanzenschutz,2,FALSE))","v":0},{"$f":"IF(D133=\"\",0,VLOOKUP(D133,PSMListe!Pflanzenschutz,2,FALSE))","v":0},{"$f":"IF(E133=\"\",0,VLOOKUP(E133,PSMListe!Pflanzenschutz,2,FALSE))","v":0},{"$f":"IF(F133=\"\",0,VLOOKUP(F133,PSMListe!Pflanzenschutz,2,FALSE))","v":0},{"$f":"IF(G133=\"\",0,VLOOKUP(G133,PSMListe!Pflanzenschutz,2,FALSE))","v":0},{"$f":"IF(H133=\"\",0,VLOOKUP(H133,PSMListe!Pflanzenschutz,2,FALSE))","v":0},{"$f":"IF(I133=\"\",0,VLOOKUP(I133,PSMListe!Pflanzenschutz,2,FALSE))","v":0},{"$f":"IF(J133=\"\",0,VLOOKUP(J133,PSMListe!Pflanzenschutz,2,FALSE))","v":0},{"$f":"IF(K133=\"\",0,VLOOKUP(K133,PSMListe!Pflanzenschutz,2,FALSE))","v":0},{"$f":"IF(L133=\"\",0,VLOOKUP(L133,PSMListe!Pflanzenschutz,2,FALSE))","v":0},{"$f":"IF(M133=\"\",0,VLOOKUP(M133,PSMListe!Pflanzenschutz,2,FALSE))","v":0},{"$f":"IF(N133=\"\",0,VLOOKUP(N133,PSMListe!Pflanzenschutz,2,FALSE))","v":0},{"$f":"IF(O133=\"\",0,VLOOKUP(O133,PSMListe!Pflanzenschutz,2,FALSE))","v":0},{"$f":"IF(P133=\"\",0,VLOOKUP(P133,PSMListe!Pflanzenschutz,2,FALSE))","v":0},{"$f":"IF(Q133=\"\",0,VLOOKUP(Q133,PSMListe!Pflanzenschutz,2,FALSE))","v":0},{"$f":"IF(R133=\"\",0,VLOOKUP(R133,PSMListe!Pflanzenschutz,2,FALSE))","v":0},{"$f":"IF(S133=\"\",0,VLOOKUP(S133,PSMListe!Pflanzenschutz,2,FALSE))","v":0},{"$f":"IF(T133=\"\",0,VLOOKUP(T133,PSMListe!Pflanzenschutz,2,FALSE))","v":0},{"$f":"IF(U133=\"\",0,VLOOKUP(U133,PSMListe!Pflanzenschutz,2,FALSE))","v":0},{"$f":"IF(V133=\"\",0,VLOOKUP(V133,PSMListe!Pflanzenschutz,2,FALSE))","v":0},{"$f":"IF(W133=\"\",0,VLOOKUP(W133,PSMListe!Pflanzenschutz,2,FALSE))","v":0},{"$f":"IF(X133=\"\",0,VLOOKUP(X133,PSMListe!Pflanzenschutz,2,FALSE))","v":0},{"$f":"IF(Y133=\"\",0,VLOOKUP(Y133,PSMListe!Pflanzenschutz,2,FALSE))","v":0},{"$f":"IF(Z133=\"\",0,VLOOKUP(Z133,PSMListe!Pflanzenschutz,2,FALSE))","v":0},{"$f":"IF(AA133=\"\",0,VLOOKUP(AA133,PSMListe!Pflanzenschutz,2,FALSE))","v":0},{"$f":"IF(AB133=\"\",0,VLOOKUP(AB133,PSMListe!Pflanzenschutz,2,FALSE))","v":0},{"$f":"IF(AC133=\"\",0,VLOOKUP(AC133,PSMListe!Pflanzenschutz,2,FALSE))","v":0},{"$f":"IF(AD133=\"\",0,VLOOKUP(AD133,PSMListe!Pflanzenschutz,2,FALSE))","v":0},{"$f":"IF(AE133=\"\",0,VLOOKUP(AE133,PSMListe!Pflanzenschutz,2,FALSE))","v":0},{"$f":"IF(AF133=\"\",0,VLOOKUP(AF133,PSMListe!Pflanzenschutz,2,FALSE))","v":0},{"$f":"IF(AG133=\"\",0,VLOOKUP(AG133,PSMListe!Pflanzenschutz,2,FALSE))","v":0},{"$f":"IF(AH133=\"\",0,VLOOKUP(AH133,PSMListe!Pflanzenschutz,2,FALSE))","v":0},{"$f":"IF(AI133=\"\",0,VLOOKUP(AI133,PSMListe!Pflanzenschutz,2,FALSE))","v":0},{"$f":"IF(AJ133=\"\",0,VLOOKUP(AJ133,PSMListe!Pflanzenschutz,2,FALSE))","v":0},{"$f":"IF(AK133=\"\",0,VLOOKUP(AK133,PSMListe!Pflanzenschutz,2,FALSE))","v":0},{"$f":"IF(AL133=\"\",0,VLOOKUP(AL133,PSMListe!Pflanzenschutz,2,FALSE))","v":0},{"$f":"IF(AM133=\"\",0,VLOOKUP(AM133,PSMListe!Pflanzenschutz,2,FALSE))","v":0},{"$f":"IF(AN133=\"\",0,VLOOKUP(AN133,PSMListe!Pflanzenschutz,2,FALSE))","v":0},{"$f":"IF(AO133=\"\",0,VLOOKUP(AO133,PSMListe!Pflanzenschutz,2,FALSE))","v":0},{"$f":"IF(AP133=\"\",0,VLOOKUP(AP133,PSMListe!Pflanzenschutz,2,FALSE))","v":0},{"$f":"IF(AQ133=\"\",0,VLOOKUP(AQ133,PSMListe!Pflanzenschutz,2,FALSE))","v":0},{"$f":"IF(AR133=\"\",0,VLOOKUP(AR133,PSMListe!Pflanzenschutz,2,FALSE))","v":0},{"$f":"IF(AS133=\"\",0,VLOOKUP(AS133,PSMListe!Pflanzenschutz,2,FALSE))","v":0},{"$f":"IF(AT133=\"\",0,VLOOKUP(AT133,PSMListe!Pflanzenschutz,2,FALSE))","v":0},{"$f":"IF(AU133=\"\",0,VLOOKUP(AU133,PSMListe!Pflanzenschutz,2,FALSE))","v":0},{"$f":"IF(AV133=\"\",0,VLOOKUP(AV133,PSMListe!Pflanzenschutz,2,FALSE))","v":0},{"$f":"IF(AW133=\"\",0,VLOOKUP(AW133,PSMListe!Pflanzenschutz,2,FALSE))","v":0},{"$f":"IF(AX133=\"\",0,VLOOKUP(AX133,PSMListe!Pflanzenschutz,2,FALSE))","v":0},{"$f":"IF(AY133=\"\",0,VLOOKUP(AY133,PSMListe!Pflanzenschutz,2,FALSE))","v":0},{"$f":"IF(AZ133=\"\",0,VLOOKUP(AZ133,PSMListe!Pflanzenschutz,2,FALSE))","v":0},{"$f":"IF(BA133=\"\",0,VLOOKUP(BA133,PSMListe!Pflanzenschutz,2,FALSE))","v":0},{"$f":"IF(BB133=\"\",0,VLOOKUP(BB133,PSMListe!Pflanzenschutz,2,FALSE))","v":0},{"$f":"IF(BC133=\"\",0,VLOOKUP(BC133,PSMListe!Pflanzenschutz,2,FALSE))","v":0},{"$f":"IF(BD133=\"\",0,VLOOKUP(BD133,PSMListe!Pflanzenschutz,2,FALSE))","v":0},{"$f":"IF(BE133=\"\",0,VLOOKUP(BE133,PSMListe!Pflanzenschutz,2,FALSE))","v":0},{"$f":"IF(BF133=\"\",0,VLOOKUP(BF133,PSMListe!Pflanzenschutz,2,FALSE))","v":0},{"$f":"IF(BG133=\"\",0,VLOOKUP(BG133,PSMListe!Pflanzenschutz,2,FALSE))","v":0},{"$f":"IF(BH133=\"\",0,VLOOKUP(BH133,PSMListe!Pflanzenschutz,2,FALSE))","v":0},{"$f":"IF(BI133=\"\",0,VLOOKUP(BI133,PSMListe!Pflanzenschutz,2,FALSE))","v":0},{"$f":"IF(BJ133=\"\",0,VLOOKUP(BJ133,PSMListe!Pflanzenschutz,2,FALSE))","v":0}]
[null,"Menge"]
[null,"Bemerkung"]
[null,"Datum"]
[null,"Mittel 27"]
[null,"Preis",{"$f":"IF(C138=\"\",0,VLOOKUP(C138,PSMListe!Pflanzenschutz,2,FALSE))","v":0},{"$f":"IF(D138=\"\",0,VLOOKUP(D138,PSMListe!Pflanzenschutz,2,FALSE))","v":0},{"$f":"IF(E138=\"\",0,VLOOKUP(E138,PSMListe!Pflanzenschutz,2,FALSE))","v":0},{"$f":"IF(F138=\"\",0,VLOOKUP(F138,PSMListe!Pflanzenschutz,2,FALSE))","v":0},{"$f":"IF(G138=\"\",0,VLOOKUP(G138,PSMListe!Pflanzenschutz,2,FALSE))","v":0},{"$f":"IF(H138=\"\",0,VLOOKUP(H138,PSMListe!Pflanzenschutz,2,FALSE))","v":0},{"$f":"IF(I138=\"\",0,VLOOKUP(I138,PSMListe!Pflanzenschutz,2,FALSE))","v":0},{"$f":"IF(J138=\"\",0,VLOOKUP(J138,PSMListe!Pflanzenschutz,2,FALSE))","v":0},{"$f":"IF(K138=\"\",0,VLOOKUP(K138,PSMListe!Pflanzenschutz,2,FALSE))","v":0},{"$f":"IF(L138=\"\",0,VLOOKUP(L138,PSMListe!Pflanzenschutz,2,FALSE))","v":0},{"$f":"IF(M138=\"\",0,VLOOKUP(M138,PSMListe!Pflanzenschutz,2,FALSE))","v":0},{"$f":"IF(N138=\"\",0,VLOOKUP(N138,PSMListe!Pflanzenschutz,2,FALSE))","v":0},{"$f":"IF(O138=\"\",0,VLOOKUP(O138,PSMListe!Pflanzenschutz,2,FALSE))","v":0},{"$f":"IF(P138=\"\",0,VLOOKUP(P138,PSMListe!Pflanzenschutz,2,FALSE))","v":0},{"$f":"IF(Q138=\"\",0,VLOOKUP(Q138,PSMListe!Pflanzenschutz,2,FALSE))","v":0},{"$f":"IF(R138=\"\",0,VLOOKUP(R138,PSMListe!Pflanzenschutz,2,FALSE))","v":0},{"$f":"IF(S138=\"\",0,VLOOKUP(S138,PSMListe!Pflanzenschutz,2,FALSE))","v":0},{"$f":"IF(T138=\"\",0,VLOOKUP(T138,PSMListe!Pflanzenschutz,2,FALSE))","v":0},{"$f":"IF(U138=\"\",0,VLOOKUP(U138,PSMListe!Pflanzenschutz,2,FALSE))","v":0},{"$f":"IF(V138=\"\",0,VLOOKUP(V138,PSMListe!Pflanzenschutz,2,FALSE))","v":0},{"$f":"IF(W138=\"\",0,VLOOKUP(W138,PSMListe!Pflanzenschutz,2,FALSE))","v":0},{"$f":"IF(X138=\"\",0,VLOOKUP(X138,PSMListe!Pflanzenschutz,2,FALSE))","v":0},{"$f":"IF(Y138=\"\",0,VLOOKUP(Y138,PSMListe!Pflanzenschutz,2,FALSE))","v":0},{"$f":"IF(Z138=\"\",0,VLOOKUP(Z138,PSMListe!Pflanzenschutz,2,FALSE))","v":0},{"$f":"IF(AA138=\"\",0,VLOOKUP(AA138,PSMListe!Pflanzenschutz,2,FALSE))","v":0},{"$f":"IF(AB138=\"\",0,VLOOKUP(AB138,PSMListe!Pflanzenschutz,2,FALSE))","v":0},{"$f":"IF(AC138=\"\",0,VLOOKUP(AC138,PSMListe!Pflanzenschutz,2,FALSE))","v":0},{"$f":"IF(AD138=\"\",0,VLOOKUP(AD138,PSMListe!Pflanzenschutz,2,FALSE))","v":0},{"$f":"IF(AE138=\"\",0,VLOOKUP(AE138,PSMListe!Pflanzenschutz,2,FALSE))","v":0},{"$f":"IF(AF138=\"\",0,VLOOKUP(AF138,PSMListe!Pflanzenschutz,2,FALSE))","v":0},{"$f":"IF(AG138=\"\",0,VLOOKUP(AG138,PSMListe!Pflanzenschutz,2,FALSE))","v":0},{"$f":"IF(AH138=\"\",0,VLOOKUP(AH138,PSMListe!Pflanzenschutz,2,FALSE))","v":0},{"$f":"IF(AI138=\"\",0,VLOOKUP(AI138,PSMListe!Pflanzenschutz,2,FALSE))","v":0},{"$f":"IF(AJ138=\"\",0,VLOOKUP(AJ138,PSMListe!Pflanzenschutz,2,FALSE))","v":0},{"$f":"IF(AK138=\"\",0,VLOOKUP(AK138,PSMListe!Pflanzenschutz,2,FALSE))","v":0},{"$f":"IF(AL138=\"\",0,VLOOKUP(AL138,PSMListe!Pflanzenschutz,2,FALSE))","v":0},{"$f":"IF(AM138=\"\",0,VLOOKUP(AM138,PSMListe!Pflanzenschutz,2,FALSE))","v":0},{"$f":"IF(AN138=\"\",0,VLOOKUP(AN138,PSMListe!Pflanzenschutz,2,FALSE))","v":0},{"$f":"IF(AO138=\"\",0,VLOOKUP(AO138,PSMListe!Pflanzenschutz,2,FALSE))","v":0},{"$f":"IF(AP138=\"\",0,VLOOKUP(AP138,PSMListe!Pflanzenschutz,2,FALSE))","v":0},{"$f":"IF(AQ138=\"\",0,VLOOKUP(AQ138,PSMListe!Pflanzenschutz,2,FALSE))","v":0},{"$f":"IF(AR138=\"\",0,VLOOKUP(AR138,PSMListe!Pflanzenschutz,2,FALSE))","v":0},{"$f":"IF(AS138=\"\",0,VLOOKUP(AS138,PSMListe!Pflanzenschutz,2,FALSE))","v":0},{"$f":"IF(AT138=\"\",0,VLOOKUP(AT138,PSMListe!Pflanzenschutz,2,FALSE))","v":0},{"$f":"IF(AU138=\"\",0,VLOOKUP(AU138,PSMListe!Pflanzenschutz,2,FALSE))","v":0},{"$f":"IF(AV138=\"\",0,VLOOKUP(AV138,PSMListe!Pflanzenschutz,2,FALSE))","v":0},{"$f":"IF(AW138=\"\",0,VLOOKUP(AW138,PSMListe!Pflanzenschutz,2,FALSE))","v":0},{"$f":"IF(AX138=\"\",0,VLOOKUP(AX138,PSMListe!Pflanzenschutz,2,FALSE))","v":0},{"$f":"IF(AY138=\"\",0,VLOOKUP(AY138,PSMListe!Pflanzenschutz,2,FALSE))","v":0},{"$f":"IF(AZ138=\"\",0,VLOOKUP(AZ138,PSMListe!Pflanzenschutz,2,FALSE))","v":0},{"$f":"IF(BA138=\"\",0,VLOOKUP(BA138,PSMListe!Pflanzenschutz,2,FALSE))","v":0},{"$f":"IF(BB138=\"\",0,VLOOKUP(BB138,PSMListe!Pflanzenschutz,2,FALSE))","v":0},{"$f":"IF(BC138=\"\",0,VLOOKUP(BC138,PSMListe!Pflanzenschutz,2,FALSE))","v":0},{"$f":"IF(BD138=\"\",0,VLOOKUP(BD138,PSMListe!Pflanzenschutz,2,FALSE))","v":0},{"$f":"IF(BE138=\"\",0,VLOOKUP(BE138,PSMListe!Pflanzenschutz,2,FALSE))","v":0},{"$f":"IF(BF138=\"\",0,VLOOKUP(BF138,PSMListe!Pflanzenschutz,2,FALSE))","v":0},{"$f":"IF(BG138=\"\",0,VLOOKUP(BG138,PSMListe!Pflanzenschutz,2,FALSE))","v":0},{"$f":"IF(BH138=\"\",0,VLOOKUP(BH138,PSMListe!Pflanzenschutz,2,FALSE))","v":0},{"$f":"IF(BI138=\"\",0,VLOOKUP(BI138,PSMListe!Pflanzenschutz,2,FALSE))","v":0},{"$f":"IF(BJ138=\"\",0,VLOOKUP(BJ138,PSMListe!Pflanzenschutz,2,FALSE))","v":0}]
[null,"Menge"]
[null,"Bemerkung"]
[null,"Datum"]
[null,"Mittel 28"]
[null,"Preis",{"$f":"IF(C143=\"\",0,VLOOKUP(C143,PSMListe!Pflanzenschutz,2,FALSE))","v":0},{"$f":"IF(D143=\"\",0,VLOOKUP(D143,PSMListe!Pflanzenschutz,2,FALSE))","v":0},{"$f":"IF(E143=\"\",0,VLOOKUP(E143,PSMListe!Pflanzenschutz,2,FALSE))","v":0},{"$f":"IF(F143=\"\",0,VLOOKUP(F143,PSMListe!Pflanzenschutz,2,FALSE))","v":0},{"$f":"IF(G143=\"\",0,VLOOKUP(G143,PSMListe!Pflanzenschutz,2,FALSE))","v":0},{"$f":"IF(H143=\"\",0,VLOOKUP(H143,PSMListe!Pflanzenschutz,2,FALSE))","v":0},{"$f":"IF(I143=\"\",0,VLOOKUP(I143,PSMListe!Pflanzenschutz,2,FALSE))","v":0},{"$f":"IF(J143=\"\",0,VLOOKUP(J143,PSMListe!Pflanzenschutz,2,FALSE))","v":0},{"$f":"IF(K143=\"\",0,VLOOKUP(K143,PSMListe!Pflanzenschutz,2,FALSE))","v":0},{"$f":"IF(L143=\"\",0,VLOOKUP(L143,PSMListe!Pflanzenschutz,2,FALSE))","v":0},{"$f":"IF(M143=\"\",0,VLOOKUP(M143,PSMListe!Pflanzenschutz,2,FALSE))","v":0},{"$f":"IF(N143=\"\",0,VLOOKUP(N143,PSMListe!Pflanzenschutz,2,FALSE))","v":0},{"$f":"IF(O143=\"\",0,VLOOKUP(O143,PSMListe!Pflanzenschutz,2,FALSE))","v":0},{"$f":"IF(P143=\"\",0,VLOOKUP(P143,PSMListe!Pflanzenschutz,2,FALSE))","v":0},{"$f":"IF(Q143=\"\",0,VLOOKUP(Q143,PSMListe!Pflanzenschutz,2,FALSE))","v":0},{"$f":"IF(R143=\"\",0,VLOOKUP(R143,PSMListe!Pflanzenschutz,2,FALSE))","v":0},{"$f":"IF(S143=\"\",0,VLOOKUP(S143,PSMListe!Pflanzenschutz,2,FALSE))","v":0},{"$f":"IF(T143=\"\",0,VLOOKUP(T143,PSMListe!Pflanzenschutz,2,FALSE))","v":0},{"$f":"IF(U143=\"\",0,VLOOKUP(U143,PSMListe!Pflanzenschutz,2,FALSE))","v":0},{"$f":"IF(V143=\"\",0,VLOOKUP(V143,PSMListe!Pflanzenschutz,2,FALSE))","v":0},{"$f":"IF(W143=\"\",0,VLOOKUP(W143,PSMListe!Pflanzenschutz,2,FALSE))","v":0},{"$f":"IF(X143=\"\",0,VLOOKUP(X143,PSMListe!Pflanzenschutz,2,FALSE))","v":0},{"$f":"IF(Y143=\"\",0,VLOOKUP(Y143,PSMListe!Pflanzenschutz,2,FALSE))","v":0},{"$f":"IF(Z143=\"\",0,VLOOKUP(Z143,PSMListe!Pflanzenschutz,2,FALSE))","v":0},{"$f":"IF(AA143=\"\",0,VLOOKUP(AA143,PSMListe!Pflanzenschutz,2,FALSE))","v":0},{"$f":"IF(AB143=\"\",0,VLOOKUP(AB143,PSMListe!Pflanzenschutz,2,FALSE))","v":0},{"$f":"IF(AC143=\"\",0,VLOOKUP(AC143,PSMListe!Pflanzenschutz,2,FALSE))","v":0},{"$f":"IF(AD143=\"\",0,VLOOKUP(AD143,PSMListe!Pflanzenschutz,2,FALSE))","v":0},{"$f":"IF(AE143=\"\",0,VLOOKUP(AE143,PSMListe!Pflanzenschutz,2,FALSE))","v":0},{"$f":"IF(AF143=\"\",0,VLOOKUP(AF143,PSMListe!Pflanzenschutz,2,FALSE))","v":0},{"$f":"IF(AG143=\"\",0,VLOOKUP(AG143,PSMListe!Pflanzenschutz,2,FALSE))","v":0},{"$f":"IF(AH143=\"\",0,VLOOKUP(AH143,PSMListe!Pflanzenschutz,2,FALSE))","v":0},{"$f":"IF(AI143=\"\",0,VLOOKUP(AI143,PSMListe!Pflanzenschutz,2,FALSE))","v":0},{"$f":"IF(AJ143=\"\",0,VLOOKUP(AJ143,PSMListe!Pflanzenschutz,2,FALSE))","v":0},{"$f":"IF(AK143=\"\",0,VLOOKUP(AK143,PSMListe!Pflanzenschutz,2,FALSE))","v":0},{"$f":"IF(AL143=\"\",0,VLOOKUP(AL143,PSMListe!Pflanzenschutz,2,FALSE))","v":0},{"$f":"IF(AM143=\"\",0,VLOOKUP(AM143,PSMListe!Pflanzenschutz,2,FALSE))","v":0},{"$f":"IF(AN143=\"\",0,VLOOKUP(AN143,PSMListe!Pflanzenschutz,2,FALSE))","v":0},{"$f":"IF(AO143=\"\",0,VLOOKUP(AO143,PSMListe!Pflanzenschutz,2,FALSE))","v":0},{"$f":"IF(AP143=\"\",0,VLOOKUP(AP143,PSMListe!Pflanzenschutz,2,FALSE))","v":0},{"$f":"IF(AQ143=\"\",0,VLOOKUP(AQ143,PSMListe!Pflanzenschutz,2,FALSE))","v":0},{"$f":"IF(AR143=\"\",0,VLOOKUP(AR143,PSMListe!Pflanzenschutz,2,FALSE))","v":0},{"$f":"IF(AS143=\"\",0,VLOOKUP(AS143,PSMListe!Pflanzenschutz,2,FALSE))","v":0},{"$f":"IF(AT143=\"\",0,VLOOKUP(AT143,PSMListe!Pflanzenschutz,2,FALSE))","v":0},{"$f":"IF(AU143=\"\",0,VLOOKUP(AU143,PSMListe!Pflanzenschutz,2,FALSE))","v":0},{"$f":"IF(AV143=\"\",0,VLOOKUP(AV143,PSMListe!Pflanzenschutz,2,FALSE))","v":0},{"$f":"IF(AW143=\"\",0,VLOOKUP(AW143,PSMListe!Pflanzenschutz,2,FALSE))","v":0},{"$f":"IF(AX143=\"\",0,VLOOKUP(AX143,PSMListe!Pflanzenschutz,2,FALSE))","v":0},{"$f":"IF(AY143=\"\",0,VLOOKUP(AY143,PSMListe!Pflanzenschutz,2,FALSE))","v":0},{"$f":"IF(AZ143=\"\",0,VLOOKUP(AZ143,PSMListe!Pflanzenschutz,2,FALSE))","v":0},{"$f":"IF(BA143=\"\",0,VLOOKUP(BA143,PSMListe!Pflanzenschutz,2,FALSE))","v":0},{"$f":"IF(BB143=\"\",0,VLOOKUP(BB143,PSMListe!Pflanzenschutz,2,FALSE))","v":0},{"$f":"IF(BC143=\"\",0,VLOOKUP(BC143,PSMListe!Pflanzenschutz,2,FALSE))","v":0},{"$f":"IF(BD143=\"\",0,VLOOKUP(BD143,PSMListe!Pflanzenschutz,2,FALSE))","v":0},{"$f":"IF(BE143=\"\",0,VLOOKUP(BE143,PSMListe!Pflanzenschutz,2,FALSE))","v":0},{"$f":"IF(BF143=\"\",0,VLOOKUP(BF143,PSMListe!Pflanzenschutz,2,FALSE))","v":0},{"$f":"IF(BG143=\"\",0,VLOOKUP(BG143,PSMListe!Pflanzenschutz,2,FALSE))","v":0},{"$f":"IF(BH143=\"\",0,VLOOKUP(BH143,PSMListe!Pflanzenschutz,2,FALSE))","v":0},{"$f":"IF(BI143=\"\",0,VLOOKUP(BI143,PSMListe!Pflanzenschutz,2,FALSE))","v":0},{"$f":"IF(BJ143=\"\",0,VLOOKUP(BJ143,PSMListe!Pflanzenschutz,2,FALSE))","v":0}]
[null,"Menge"]
[null,"Bemerkung"]
[null,"Datum"]
[null,"Mittel 29"]
[null,"Preis",{"$f":"IF(C148=\"\",0,VLOOKUP(C148,PSMListe!Pflanzenschutz,2,FALSE))","v":0},{"$f":"IF(D148=\"\",0,VLOOKUP(D148,PSMListe!Pflanzenschutz,2,FALSE))","v":0},{"$f":"IF(E148=\"\",0,VLOOKUP(E148,PSMListe!Pflanzenschutz,2,FALSE))","v":0},{"$f":"IF(F148=\"\",0,VLOOKUP(F148,PSMListe!Pflanzenschutz,2,FALSE))","v":0},{"$f":"IF(G148=\"\",0,VLOOKUP(G148,PSMListe!Pflanzenschutz,2,FALSE))","v":0},{"$f":"IF(H148=\"\",0,VLOOKUP(H148,PSMListe!Pflanzenschutz,2,FALSE))","v":0},{"$f":"IF(I148=\"\",0,VLOOKUP(I148,PSMListe!Pflanzenschutz,2,FALSE))","v":0},{"$f":"IF(J148=\"\",0,VLOOKUP(J148,PSMListe!Pflanzenschutz,2,FALSE))","v":0},{"$f":"IF(K148=\"\",0,VLOOKUP(K148,PSMListe!Pflanzenschutz,2,FALSE))","v":0},{"$f":"IF(L148=\"\",0,VLOOKUP(L148,PSMListe!Pflanzenschutz,2,FALSE))","v":0},{"$f":"IF(M148=\"\",0,VLOOKUP(M148,PSMListe!Pflanzenschutz,2,FALSE))","v":0},{"$f":"IF(N148=\"\",0,VLOOKUP(N148,PSMListe!Pflanzenschutz,2,FALSE))","v":0},{"$f":"IF(O148=\"\",0,VLOOKUP(O148,PSMListe!Pflanzenschutz,2,FALSE))","v":0},{"$f":"IF(P148=\"\",0,VLOOKUP(P148,PSMListe!Pflanzenschutz,2,FALSE))","v":0},{"$f":"IF(Q148=\"\",0,VLOOKUP(Q148,PSMListe!Pflanzenschutz,2,FALSE))","v":0},{"$f":"IF(R148=\"\",0,VLOOKUP(R148,PSMListe!Pflanzenschutz,2,FALSE))","v":0},{"$f":"IF(S148=\"\",0,VLOOKUP(S148,PSMListe!Pflanzenschutz,2,FALSE))","v":0},{"$f":"IF(T148=\"\",0,VLOOKUP(T148,PSMListe!Pflanzenschutz,2,FALSE))","v":0},{"$f":"IF(U148=\"\",0,VLOOKUP(U148,PSMListe!Pflanzenschutz,2,FALSE))","v":0},{"$f":"IF(V148=\"\",0,VLOOKUP(V148,PSMListe!Pflanzenschutz,2,FALSE))","v":0},{"$f":"IF(W148=\"\",0,VLOOKUP(W148,PSMListe!Pflanzenschutz,2,FALSE))","v":0},{"$f":"IF(X148=\"\",0,VLOOKUP(X148,PSMListe!Pflanzenschutz,2,FALSE))","v":0},{"$f":"IF(Y148=\"\",0,VLOOKUP(Y148,PSMListe!Pflanzenschutz,2,FALSE))","v":0},{"$f":"IF(Z148=\"\",0,VLOOKUP(Z148,PSMListe!Pflanzenschutz,2,FALSE))","v":0},{"$f":"IF(AA148=\"\",0,VLOOKUP(AA148,PSMListe!Pflanzenschutz,2,FALSE))","v":0},{"$f":"IF(AB148=\"\",0,VLOOKUP(AB148,PSMListe!Pflanzenschutz,2,FALSE))","v":0},{"$f":"IF(AC148=\"\",0,VLOOKUP(AC148,PSMListe!Pflanzenschutz,2,FALSE))","v":0},{"$f":"IF(AD148=\"\",0,VLOOKUP(AD148,PSMListe!Pflanzenschutz,2,FALSE))","v":0},{"$f":"IF(AE148=\"\",0,VLOOKUP(AE148,PSMListe!Pflanzenschutz,2,FALSE))","v":0},{"$f":"IF(AF148=\"\",0,VLOOKUP(AF148,PSMListe!Pflanzenschutz,2,FALSE))","v":0},{"$f":"IF(AG148=\"\",0,VLOOKUP(AG148,PSMListe!Pflanzenschutz,2,FALSE))","v":0},{"$f":"IF(AH148=\"\",0,VLOOKUP(AH148,PSMListe!Pflanzenschutz,2,FALSE))","v":0},{"$f":"IF(AI148=\"\",0,VLOOKUP(AI148,PSMListe!Pflanzenschutz,2,FALSE))","v":0},{"$f":"IF(AJ148=\"\",0,VLOOKUP(AJ148,PSMListe!Pflanzenschutz,2,FALSE))","v":0},{"$f":"IF(AK148=\"\",0,VLOOKUP(AK148,PSMListe!Pflanzenschutz,2,FALSE))","v":0},{"$f":"IF(AL148=\"\",0,VLOOKUP(AL148,PSMListe!Pflanzenschutz,2,FALSE))","v":0},{"$f":"IF(AM148=\"\",0,VLOOKUP(AM148,PSMListe!Pflanzenschutz,2,FALSE))","v":0},{"$f":"IF(AN148=\"\",0,VLOOKUP(AN148,PSMListe!Pflanzenschutz,2,FALSE))","v":0},{"$f":"IF(AO148=\"\",0,VLOOKUP(AO148,PSMListe!Pflanzenschutz,2,FALSE))","v":0},{"$f":"IF(AP148=\"\",0,VLOOKUP(AP148,PSMListe!Pflanzenschutz,2,FALSE))","v":0},{"$f":"IF(AQ148=\"\",0,VLOOKUP(AQ148,PSMListe!Pflanzenschutz,2,FALSE))","v":0},{"$f":"IF(AR148=\"\",0,VLOOKUP(AR148,PSMListe!Pflanzenschutz,2,FALSE))","v":0},{"$f":"IF(AS148=\"\",0,VLOOKUP(AS148,PSMListe!Pflanzenschutz,2,FALSE))","v":0},{"$f":"IF(AT148=\"\",0,VLOOKUP(AT148,PSMListe!Pflanzenschutz,2,FALSE))","v":0},{"$f":"IF(AU148=\"\",0,VLOOKUP(AU148,PSMListe!Pflanzenschutz,2,FALSE))","v":0},{"$f":"IF(AV148=\"\",0,VLOOKUP(AV148,PSMListe!Pflanzenschutz,2,FALSE))","v":0},{"$f":"IF(AW148=\"\",0,VLOOKUP(AW148,PSMListe!Pflanzenschutz,2,FALSE))","v":0},{"$f":"IF(AX148=\"\",0,VLOOKUP(AX148,PSMListe!Pflanzenschutz,2,FALSE))","v":0},{"$f":"IF(AY148=\"\",0,VLOOKUP(AY148,PSMListe!Pflanzenschutz,2,FALSE))","v":0},{"$f":"IF(AZ148=\"\",0,VLOOKUP(AZ148,PSMListe!Pflanzenschutz,2,FALSE))","v":0},{"$f":"IF(BA148=\"\",0,VLOOKUP(BA148,PSMListe!Pflanzenschutz,2,FALSE))","v":0},{"$f":"IF(BB148=\"\",0,VLOOKUP(BB148,PSMListe!Pflanzenschutz,2,FALSE))","v":0},{"$f":"IF(BC148=\"\",0,VLOOKUP(BC148,PSMListe!Pflanzenschutz,2,FALSE))","v":0},{"$f":"IF(BD148=\"\",0,VLOOKUP(BD148,PSMListe!Pflanzenschutz,2,FALSE))","v":0},{"$f":"IF(BE148=\"\",0,VLOOKUP(BE148,PSMListe!Pflanzenschutz,2,FALSE))","v":0},{"$f":"IF(BF148=\"\",0,VLOOKUP(BF148,PSMListe!Pflanzenschutz,2,FALSE))","v":0},{"$f":"IF(BG148=\"\",0,VLOOKUP(BG148,PSMListe!Pflanzenschutz,2,FALSE))","v":0},{"$f":"IF(BH148=\"\",0,VLOOKUP(BH148,PSMListe!Pflanzenschutz,2,FALSE))","v":0},{"$f":"IF(BI148=\"\",0,VLOOKUP(BI148,PSMListe!Pflanzenschutz,2,FALSE))","v":0},{"$f":"IF(BJ148=\"\",0,VLOOKUP(BJ148,PSMListe!Pflanzenschutz,2,FALSE))","v":0}]
[null,"Menge"]
[null,"Bemerkung"]
[null,"Datum"]
[null,"Mittel 30"]
[null,"Preis",{"$f":"IF(C153=\"\",0,VLOOKUP(C153,PSMListe!Pflanzenschutz,2,FALSE))","v":0},{"$f":"IF(D153=\"\",0,VLOOKUP(D153,PSMListe!Pflanzenschutz,2,FALSE))","v":0},{"$f":"IF(E153=\"\",0,VLOOKUP(E153,PSMListe!Pflanzenschutz,2,FALSE))","v":0},{"$f":"IF(F153=\"\",0,VLOOKUP(F153,PSMListe!Pflanzenschutz,2,FALSE))","v":0},{"$f":"IF(G153=\"\",0,VLOOKUP(G153,PSMListe!Pflanzenschutz,2,FALSE))","v":0},{"$f":"IF(H153=\"\",0,VLOOKUP(H153,PSMListe!Pflanzenschutz,2,FALSE))","v":0},{"$f":"IF(I153=\"\",0,VLOOKUP(I153,PSMListe!Pflanzenschutz,2,FALSE))","v":0},{"$f":"IF(J153=\"\",0,VLOOKUP(J153,PSMListe!Pflanzenschutz,2,FALSE))","v":0},{"$f":"IF(K153=\"\",0,VLOOKUP(K153,PSMListe!Pflanzenschutz,2,FALSE))","v":0},{"$f":"IF(L153=\"\",0,VLOOKUP(L153,PSMListe!Pflanzenschutz,2,FALSE))","v":0},{"$f":"IF(M153=\"\",0,VLOOKUP(M153,PSMListe!Pflanzenschutz,2,FALSE))","v":0},{"$f":"IF(N153=\"\",0,VLOOKUP(N153,PSMListe!Pflanzenschutz,2,FALSE))","v":0},{"$f":"IF(O153=\"\",0,VLOOKUP(O153,PSMListe!Pflanzenschutz,2,FALSE))","v":0},{"$f":"IF(P153=\"\",0,VLOOKUP(P153,PSMListe!Pflanzenschutz,2,FALSE))","v":0},{"$f":"IF(Q153=\"\",0,VLOOKUP(Q153,PSMListe!Pflanzenschutz,2,FALSE))","v":0},{"$f":"IF(R153=\"\",0,VLOOKUP(R153,PSMListe!Pflanzenschutz,2,FALSE))","v":0},{"$f":"IF(S153=\"\",0,VLOOKUP(S153,PSMListe!Pflanzenschutz,2,FALSE))","v":0},{"$f":"IF(T153=\"\",0,VLOOKUP(T153,PSMListe!Pflanzenschutz,2,FALSE))","v":0},{"$f":"IF(U153=\"\",0,VLOOKUP(U153,PSMListe!Pflanzenschutz,2,FALSE))","v":0},{"$f":"IF(V153=\"\",0,VLOOKUP(V153,PSMListe!Pflanzenschutz,2,FALSE))","v":0},{"$f":"IF(W153=\"\",0,VLOOKUP(W153,PSMListe!Pflanzenschutz,2,FALSE))","v":0},{"$f":"IF(X153=\"\",0,VLOOKUP(X153,PSMListe!Pflanzenschutz,2,FALSE))","v":0},{"$f":"IF(Y153=\"\",0,VLOOKUP(Y153,PSMListe!Pflanzenschutz,2,FALSE))","v":0},{"$f":"IF(Z153=\"\",0,VLOOKUP(Z153,PSMListe!Pflanzenschutz,2,FALSE))","v":0},{"$f":"IF(AA153=\"\",0,VLOOKUP(AA153,PSMListe!Pflanzenschutz,2,FALSE))","v":0},{"$f":"IF(AB153=\"\",0,VLOOKUP(AB153,PSMListe!Pflanzenschutz,2,FALSE))","v":0},{"$f":"IF(AC153=\"\",0,VLOOKUP(AC153,PSMListe!Pflanzenschutz,2,FALSE))","v":0},{"$f":"IF(AD153=\"\",0,VLOOKUP(AD153,PSMListe!Pflanzenschutz,2,FALSE))","v":0},{"$f":"IF(AE153=\"\",0,VLOOKUP(AE153,PSMListe!Pflanzenschutz,2,FALSE))","v":0},{"$f":"IF(AF153=\"\",0,VLOOKUP(AF153,PSMListe!Pflanzenschutz,2,FALSE))","v":0},{"$f":"IF(AG153=\"\",0,VLOOKUP(AG153,PSMListe!Pflanzenschutz,2,FALSE))","v":0},{"$f":"IF(AH153=\"\",0,VLOOKUP(AH153,PSMListe!Pflanzenschutz,2,FALSE))","v":0},{"$f":"IF(AI153=\"\",0,VLOOKUP(AI153,PSMListe!Pflanzenschutz,2,FALSE))","v":0},{"$f":"IF(AJ153=\"\",0,VLOOKUP(AJ153,PSMListe!Pflanzenschutz,2,FALSE))","v":0},{"$f":"IF(AK153=\"\",0,VLOOKUP(AK153,PSMListe!Pflanzenschutz,2,FALSE))","v":0},{"$f":"IF(AL153=\"\",0,VLOOKUP(AL153,PSMListe!Pflanzenschutz,2,FALSE))","v":0},{"$f":"IF(AM153=\"\",0,VLOOKUP(AM153,PSMListe!Pflanzenschutz,2,FALSE))","v":0},{"$f":"IF(AN153=\"\",0,VLOOKUP(AN153,PSMListe!Pflanzenschutz,2,FALSE))","v":0},{"$f":"IF(AO153=\"\",0,VLOOKUP(AO153,PSMListe!Pflanzenschutz,2,FALSE))","v":0},{"$f":"IF(AP153=\"\",0,VLOOKUP(AP153,PSMListe!Pflanzenschutz,2,FALSE))","v":0},{"$f":"IF(AQ153=\"\",0,VLOOKUP(AQ153,PSMListe!Pflanzenschutz,2,FALSE))","v":0},{"$f":"IF(AR153=\"\",0,VLOOKUP(AR153,PSMListe!Pflanzenschutz,2,FALSE))","v":0},{"$f":"IF(AS153=\"\",0,VLOOKUP(AS153,PSMListe!Pflanzenschutz,2,FALSE))","v":0},{"$f":"IF(AT153=\"\",0,VLOOKUP(AT153,PSMListe!Pflanzenschutz,2,FALSE))","v":0},{"$f":"IF(AU153=\"\",0,VLOOKUP(AU153,PSMListe!Pflanzenschutz,2,FALSE))","v":0},{"$f":"IF(AV153=\"\",0,VLOOKUP(AV153,PSMListe!Pflanzenschutz,2,FALSE))","v":0},{"$f":"IF(AW153=\"\",0,VLOOKUP(AW153,PSMListe!Pflanzenschutz,2,FALSE))","v":0},{"$f":"IF(AX153=\"\",0,VLOOKUP(AX153,PSMListe!Pflanzenschutz,2,FALSE))","v":0},{"$f":"IF(AY153=\"\",0,VLOOKUP(AY153,PSMListe!Pflanzenschutz,2,FALSE))","v":0},{"$f":"IF(AZ153=\"\",0,VLOOKUP(AZ153,PSMListe!Pflanzenschutz,2,FALSE))","v":0},{"$f":"IF(BA153=\"\",0,VLOOKUP(BA153,PSMListe!Pflanzenschutz,2,FALSE))","v":0},{"$f":"IF(BB153=\"\",0,VLOOKUP(BB153,PSMListe!Pflanzenschutz,2,FALSE))","v":0},{"$f":"IF(BC153=\"\",0,VLOOKUP(BC153,PSMListe!Pflanzenschutz,2,FALSE))","v":0},{"$f":"IF(BD153=\"\",0,VLOOKUP(BD153,PSMListe!Pflanzenschutz,2,FALSE))","v":0},{"$f":"IF(BE153=\"\",0,VLOOKUP(BE153,PSMListe!Pflanzenschutz,2,FALSE))","v":0},{"$f":"IF(BF153=\"\",0,VLOOKUP(BF153,PSMListe!Pflanzenschutz,2,FALSE))","v":0},{"$f":"IF(BG153=\"\",0,VLOOKUP(BG153,PSMListe!Pflanzenschutz,2,FALSE))","v":0},{"$f":"IF(BH153=\"\",0,VLOOKUP(BH153,PSMListe!Pflanzenschutz,2,FALSE))","v":0},{"$f":"IF(BI153=\"\",0,VLOOKUP(BI153,PSMListe!Pflanzenschutz,2,FALSE))","v":0},{"$f":"IF(BJ153=\"\",0,VLOOKUP(BJ153,PSMListe!Pflanzenschutz,2,FALSE))","v":0}]
[null,"Menge"]
[null,"Bemerkung"]
[null,"Kosten / ha",{"$f":"C9*C10+C14*C15+C19*C20+C24*C25+C29*C30+C34*C35+C39*C40+C44*C45+C49*C50+C54*C55+C59*C60+C64*C65+C69*C70+C74*C75+C79*C80+C84*C85+C89*C90+C94*C95+C99*C100+C104*C105+C109*C110+C114*C115+C119*C120+C124*C125+C129*C130+C134*C135+C139*C140+C144*C145+C149*C150+C154*C155","v":238.26750000000001},{"$f":"D9*D10+D14*D15+D19*D20+D24*D25+D29*D30+D34*D35+D39*D40+D44*D45+D49*D50+D54*D55+D59*D60+D64*D65+D69*D70+D74*D75+D79*D80+D84*D85+D89*D90+D94*D95+D99*D100+D104*D105+D109*D110+D114*D115+D119*D120+D124*D125+D129*D130+D134*D135+D139*D140+D144*D145+D149*D150+D154*D155","v":0},0,0,0,0,0,0,0,0,0,0,0,0,0,0,0,0,0,0,0,0,0,0,0,0,0,0,0,0,0,0,0,0,0,0,0,0,0,0,0,0,0,0,0,0,0,0,0,0,0,0,0,0,0,0,0,0,0,0]
[null,"Kosten gesamt",{"$f":"C157*C6","v":905.41650000000004},0,0,0,0,0,0,0,0,0,0,0,0,0,0,0,0,0,0,0,0,0,0,0,0,0,0,0,0,0,0,0,{"$f":"AI157*AI6","v":0},0,0,0,0,0,0,0,0,0,0,0,0,0,0,0,0,0,0,0,0,0,0,0,0,0,0,0,{"$f":"SUM(C158:BJ158)","v":905.41650000000004}]

{"sheet":"Düngung","index":2,"n_rows":371,"n_cols":63,"rows_kept":371,"cut":false,"hidden":false,"merged":[[167,1,167,16]]}
[]
[null,"Düngung"]
[null,"Schlag",{"$f":"Betriebsdaten!C11","v":"Bester Feld"},{"$f":"Betriebsdaten!D11","v":0},{"$f":"Betriebsdaten!E11","v":0},{"$f":"Betriebsdaten!F11","v":0},{"$f":"Betriebsdaten!G11","v":0},{"$f":"Betriebsdaten!H11","v":0},{"$f":"Betriebsdaten!I11","v":0},{"$f":"Betriebsdaten!J11","v":0},{"$f":"Betriebsdaten!K11","v":0},{"$f":"Betriebsdaten!L11","v":0},{"$f":"Betriebsdaten!M11","v":0},{"$f":"Betriebsdaten!N11","v":0},{"$f":"Betriebsdaten!O11","v":0},{"$f":"Betriebsdaten!P11","v":0},{"$f":"Betriebsdaten!Q11","v":0},{"$f":"Betriebsdaten!R11","v":0},{"$f":"Betriebsdaten!S11","v":0},{"$f":"Betriebsdaten!T11","v":0},{"$f":"Betriebsdaten!U11","v":0},{"$f":"Betriebsdaten!V11","v":0},{"$f":"Betriebsdaten!W11","v":0},{"$f":"Betriebsdaten!X11","v":0},{"$f":"Betriebsdaten!Y11","v":0},{"$f":"Betriebsdaten!Z11","v":0},{"$f":"Betriebsdaten!AA11","v":25},{"$f":"Betriebsdaten!AB11","v":26},{"$f":"Betriebsdaten!AC11","v":27},{"$f":"Betriebsdaten!AD11","v":28},{"$f":"Betriebsdaten!AE11","v":29},{"$f":"Betriebsdaten!AF11","v":30},{"$f":"Betriebsdaten!AG11","v":31},{"$f":"Betriebsdaten!AH11","v":32},{"$f":"Betriebsdaten!AI11","v":33},{"$f":"Betriebsdaten!AJ11","v":34},{"$f":"Betriebsdaten!AK11","v":35},{"$f":"Betriebsdaten!AL11","v":36},{"$f":"Betriebsdaten!AM11","v":37},{"$f":"Betriebsdaten!AN11","v":38},{"$f":"Betriebsdaten!AO11","v":39},{"$f":"Betriebsdaten!AP11","v":40},{"$f":"Betriebsdaten!AQ11","v":41},{"$f":"Betriebsdaten!AR11","v":42},{"$f":"Betriebsdaten!AS11","v":43},{"$f":"Betriebsdaten!AT11","v":44},{"$f":"Betriebsdaten!AU11","v":45},{"$f":"Betriebsdaten!AV11","v":46},{"$f":"Betriebsdaten!AW11","v":47},{"$f":"Betriebsdaten!AX11","v":48},{"$f":"Betriebsdaten!AY11","v":49},{"$f":"Betriebsdaten!AZ11","v":50},{"$f":"Betriebsdaten!BA11","v":51},{"$f":"Betriebsdaten!BB11","v":52},{"$f":"Betriebsdaten!BC11","v":53},{"$f":"Betriebsdaten!BD11","v":54},{"$f":"Betriebsdaten!BE11","v":55},{"$f":"Betriebsdaten!BF11","v":56},{"$f":"Betriebsdaten!BG11","v":57},{"$f":"Betriebsdaten!BH11","v":58},{"$f":"Betriebsdaten!BI11","v":59},{"$f":"Betriebsdaten!BJ11","v":60}]
[null,"Frucht",{"$f":"Betriebsdaten!C15","v":"Spargel"},{"$f":"Betriebsdaten!D15","v":0},{"$f":"Betriebsdaten!E15","v":0},{"$f":"Betriebsdaten!F15","v":0},{"$f":"Betriebsdaten!G15","v":0},{"$f":"Betriebsdaten!H15","v":0},{"$f":"Betriebsdaten!I15","v":0},{"$f":"Betriebsdaten!J15","v":0},{"$f":"Betriebsdaten!K15","v":0},{"$f":"Betriebsdaten!L15","v":0},{"$f":"Betriebsdaten!M15","v":0},{"$f":"Betriebsdaten!N15","v":0},{"$f":"Betriebsdaten!O15","v":0},{"$f":"Betriebsdaten!P15","v":0},{"$f":"Betriebsdaten!Q15","v":0},{"$f":"Betriebsdaten!R15","v":0},{"$f":"Betriebsdaten!S15","v":0},{"$f":"Betriebsdaten!T15","v":0},{"$f":"Betriebsdaten!U15","v":0},{"$f":"Betriebsdaten!V15","v":0},{"$f":"Betriebsdaten!W15","v":0},{"$f":"Betriebsdaten!X15","v":0},{"$f":"Betriebsdaten!Y15","v":0},{"$f":"Betriebsdaten!Z15","v":0},{"$f":"Betriebsdaten!AA15","v":0},{"$f":"Betriebsdaten!AB15","v":0},{"$f":"Betriebsdaten!AC15","v":0},{"$f":"Betriebsdaten!AD15","v":0},{"$f":"Betriebsdaten!AE15","v":0},{"$f":"Betriebsdaten!AF15","v":0},{"$f":"Betriebsdaten!AG15","v":0},{"$f":"Betriebsdaten!AH15","v":0},{"$f":"Betriebsdaten!AI15","v":0},{"$f":"Betriebsdaten!AJ15","v":0},{"$f":"Betriebsdaten!AK15","v":0},{"$f":"Betriebsdaten!AL15","v":0},{"$f":"Betriebsdaten!AM15","v":0},{"$f":"Betriebsdaten!AN15","v":0},{"$f":"Betriebsdaten!AO15","v":0},{"$f":"Betriebsdaten!AP15","v":0},{"$f":"Betriebsdaten!AQ15","v":0},{"$f":"Betriebsdaten!AR15","v":0},{"$f":"Betriebsdaten!AS15","v":0},{"$f":"Betriebsdaten!AT15","v":0},{"$f":"Betriebsdaten!AU15","v":0},{"$f":"Betriebsdaten!AV15","v":0},{"$f":"Betriebsdaten!AW15","v":0},{"$f":"Betriebsdaten!AX15","v":0},{"$f":"Betriebsdaten!AY15","v":0},{"$f":"Betriebsdaten!AZ15","v":0},{"$f":"Betriebsdaten!BA15","v":0},{"$f":"Betriebsdaten!BB15","v":0},{"$f":"Betriebsdaten!BC15","v":0},{"$f":"Betriebsdaten!BD15","v":0},{"$f":"Betriebsdaten!BE15","v":0},{"$f":"Betriebsdaten!BF15","v":0},{"$f":"Betriebsdaten!BG15","v":0},{"$f":"Betriebsdaten!BH15","v":0},{"$f":"Betriebsdaten!BI15","v":0},{"$f":"Betriebsdaten!BJ15","v":0}]
[null,"Sorte",{"$f":"Betriebsdaten!C16","v":"Gijnlim"},{"$f":"Betriebsdaten!D16","v":0},{"$f":"Betriebsdaten!E16","v":0},{"$f":"Betriebsdaten!F16","v":0},{"$f":"Betriebsdaten!G16","v":0},{"$f":"Betriebsdaten!H16","v":0},{"$f":"Betriebsdaten!I16","v":0},{"$f":"Betriebsdaten!J16","v":0},{"$f":"Betriebsdaten!K16","v":0},{"$f":"Betriebsdaten!L16","v":0},{"$f":"Betriebsdaten!M16","v":0},{"$f":"Betriebsdaten!N16","v":0},{"$f":"Betriebsdaten!O16","v":0},{"$f":"Betriebsdaten!P16","v":0},{"$f":"Betriebsdaten!Q16","v":0},{"$f":"Betriebsdaten!R16","v":0},{"$f":"Betriebsdaten!S16","v":0},{"$f":"Betriebsdaten!T16","v":0},{"$f":"Betriebsdaten!U16","v":0},{"$f":"Betriebsdaten!V16","v":0},{"$f":"Betriebsdaten!W16","v":0},{"$f":"Betriebsdaten!X16","v":0},{"$f":"Betriebsdaten!Y16","v":0},{"$f":"Betriebsdaten!Z16","v":0},{"$f":"Betriebsdaten!AA16","v":0},{"$f":"Betriebsdaten!AB16","v":0},{"$f":"Betriebsdaten!AC16","v":0},{"$f":"Betriebsdaten!AD16","v":0},{"$f":"Betriebsdaten!AE16","v":0},{"$f":"Betriebsdaten!AF16","v":0},{"$f":"Betriebsdaten!AG16","v":0},{"$f":"Betriebsdaten!AH16","v":0},{"$f":"Betriebsdaten!AI16","v":0},{"$f":"Betriebsdaten!AJ16","v":0},{"$f":"Betriebsdaten!AK16","v":0},{"$f":"Betriebsdaten!AL16","v":0},{"$f":"Betriebsdaten!AM16","v":0},{"$f":"Betriebsdaten!AN16","v":0},{"$f":"Betriebsdaten!AO16","v":0},{"$f":"Betriebsdaten!AP16","v":0},{"$f":"Betriebsdaten!AQ16","v":0},{"$f":"Betriebsdaten!AR16","v":0},{"$f":"Betriebsdaten!AS16","v":0},{"$f":"Betriebsdaten!AT16","v":0},{"$f":"Betriebsdaten!AU16","v":0},{"$f":"Betriebsdaten!AV16","v":0},{"$f":"Betriebsdaten!AW16","v":0},{"$f":"Betriebsdaten!AX16","v":0},{"$f":"Betriebsdaten!AY16","v":0},{"$f":"Betriebsdaten!AZ16","v":0},{"$f":"Betriebsdaten!BA16","v":0},{"$f":"Betriebsdaten!BB16","v":0},{"$f":"Betriebsdaten!BC16","v":0},{"$f":"Betriebsdaten!BD16","v":0},{"$f":"Betriebsdaten!BE16","v":0},{"$f":"Betriebsdaten!BF16","v":0},{"$f":"Betriebsdaten!BG16","v":0},{"$f":"Betriebsdaten!BH16","v":0},{"$f":"Betriebsdaten!BI16","v":0},{"$f":"Betriebsdaten!BJ16","v":0}]
[null,"ha",{"$f":"Betriebsdaten!C17","v":3.8},{"$f":"Betriebsdaten!D17","v":0},{"$f":"Betriebsdaten!E17","v":0},{"$f":"Betriebsdaten!F17","v":0},{"$f":"Betriebsdaten!G17","v":0},{"$f":"Betriebsdaten!H17","v":0},{"$f":"Betriebsdaten!I17","v":0},{"$f":"Betriebsdaten!J17","v":0},{"$f":"Betriebsdaten!K17","v":0},{"$f":"Betriebsdaten!L17","v":0},{"$f":"Betriebsdaten!M17","v":0},{"$f":"Betriebsdaten!N17","v":0},{"$f":"Betriebsdaten!O17","v":0},{"$f":"Betriebsdaten!P17","v":0},{"$f":"Betriebsdaten!Q17","v":0},{"$f":"Betriebsdaten!R17","v":0},{"$f":"Betriebsdaten!S17","v":0},{"$f":"Betriebsdaten!T17","v":0},{"$f":"Betriebsdaten!U17","v":0},{"$f":"Betriebsdaten!V17","v":0},{"$f":"Betriebsdaten!W17","v":0},{"$f":"Betriebsdaten!X17","v":0},{"$f":"Betriebsdaten!Y17","v":0},{"$f":"Betriebsdaten!Z17","v":0},{"$f":"Betriebsdaten!AA17","v":0},{"$f":"Betriebsdaten!AB17","v":0},{"$f":"Betriebsdaten!AC17","v":0},{"$f":"Betriebsdaten!AD17","v":0},{"$f":"Betriebsdaten!AE17","v":0},{"$f":"Betriebsdaten!AF17","v":0},{"$f":"Betriebsdaten!AG17","v":0},{"$f":"Betriebsdaten!AH17","v":0},{"$f":"Betriebsdaten!AI17","v":0},{"$f":"Betriebsdaten!AJ17","v":0},{"$f":"Betriebsdaten!AK17","v":0},{"$f":"Betriebsdaten!AL17","v":0},{"$f":"Betriebsdaten!AM17","v":0},{"$f":"Betriebsdaten!AN17","v":0},{"$f":"Betriebsdaten!AO17","v":0},{"$f":"Betriebsdaten!AP17","v":0},{"$f":"Betriebsdaten!AQ17","v":0},{"$f":"Betriebsdaten!AR17","v":0},{"$f":"Betriebsdaten!AS17","v":0},{"$f":"Betriebsdaten!AT17","v":0},{"$f":"Betriebsdaten!AU17","v":0},{"$f":"Betriebsdaten!AV17","v":0},{"$f":"Betriebsdaten!AW17","v":0},{"$f":"Betriebsdaten!AX17","v":0},{"$f":"Betriebsdaten!AY17","v":0},{"$f":"Betriebsdaten!AZ17","v":0},{"$f":"Betriebsdaten!BA17","v":0},{"$f":"Betriebsdaten!BB17","v":0},{"$f":"Betriebsdaten!BC17","v":0},{"$f":"Betriebsdaten!BD17","v":0},{"$f":"Betriebsdaten!BE17","v":0},{"$f":"Betriebsdaten!BF17","v":0},{"$f":"Betriebsdaten!BG17","v":0},{"$f":"Betriebsdaten!BH17","v":0},{"$f":"Betriebsdaten!BI17","v":0},{"$f":"Betriebsdaten!BJ17","v":0}]
[null,"Datum ","2018-05-25"]
[null,"Dünger 1","KAS"]
[null,"Preis",{"$f":"IF(C8=\"\",0,VLOOKUP(C8,Düngemittel,3,FALSE))","v":28.5},0,0,0,0,0,0,0,0,0,0,0,0,0,0,0,0,0,0,0,0,0,0,0,0,0,0,0,0,0,0,0,{"$f":"IF(AI8=\"\",0,VLOOKUP(AI8,Düngemittel,3,FALSE))","v":0},0,0,0,0,0,0,0,0,0,0,0,0,0,0,0,0,0,0,0,0,0,0,0,0,0,0,0]
[null,"Menge/ha",1]
[null,"Bemerkung","Ralf, NP Max Bedarf        "]
[null,"Datum ","2018-05-25"]
[null,"Dünger 2","40 er Kali"]
[null,"Preis",{"$f":"IF(C13=\"\",0,VLOOKUP(C13,Düngemittel,3,FALSE))","v":28.25},0,0,0,0,0,0,0,0,0,0,0,0,0,0,0,0,0,0,0,0,0,0,0,0,0,0,0,0,0,0,0,{"$f":"IF(AI13=\"\",0,VLOOKUP(AI13,Düngemittel,3,FALSE))","v":0},0,0,0,0,0,0,0,0,0,0,0,0,0,0,0,0,0,0,0,0,0,0,0,0,0,0,0]
[null,"Menge/ha",2.5]
[null,"Bemerkung"]
[null,"Datum "]
[null,"Dünger 3"]
[null,"Preis",{"$f":"IF(C18=\"\",0,VLOOKUP(C18,Düngemittel,3,FALSE))","v":0},0,0,0,0,0,0,0,0,0,0,0,0,0,0,0,0,0,0,0,0,0,0,0,0,0,0,0,0,0,0,0,{"$f":"IF(AI18=\"\",0,VLOOKUP(AI18,Düngemittel,3,FALSE))","v":0},0,0,0,0,0,0,0,0,0,0,0,0,0,0,0,0,0,0,0,0,0,0,0,0,0,0,0]
[null,"Menge/ha"]
[null,"Bemerkung"]
[null,"Datum"]
[null,"Dünger 4"]
[null,"Preis",{"$f":"IF(C23=\"\",0,VLOOKUP(C23,Düngemittel,3,FALSE))","v":0},0,0,0,0,0,0,0,0,0,0,0,0,0,0,0,0,0,0,0,0,0,0,0,0,0,0,0,0,0,0,0,{"$f":"IF(AI23=\"\",0,VLOOKUP(AI23,Düngemittel,3,FALSE))","v":0},0,0,0,0,0,0,0,0,0,0,0,0,0,0,0,0,0,0,0,0,0,0,0,0,0,0,0]
[null,"Menge/ha"]
[null,"Bemerkung"]
[null,"Datum "]
[null,"Dünger 5"]
[null,"Preis",{"$f":"IF(C28=\"\",0,VLOOKUP(C28,Düngemittel,3,FALSE))","v":0},0,0,0,0,0,0,0,0,0,0,0,0,0,0,0,0,0,0,0,0,0,0,0,0,0,0,0,0,0,0,0,{"$f":"IF(AI28=\"\",0,VLOOKUP(AI28,Düngemittel,3,FALSE))","v":0},0,0,0,0,0,0,0,0,0,0,0,0,0,0,0,0,0,0,0,0,0,0,0,0,0,0,0]
[null,"Menge/ha"]
[null,"Bemerkung"]
[null,"Datum"]
[null,"Dünger 6"]
[null,"Preis",{"$f":"IF(C33=\"\",0,VLOOKUP(C33,Düngemittel,3,FALSE))","v":0},0,0,0,0,0,0,0,0,0,0,0,0,0,0,0,0,0,0,0,0,0,0,0,0,0,0,0,0,0,0,0,{"$f":"IF(AI33=\"\",0,VLOOKUP(AI33,Düngemittel,3,FALSE))","v":0},0,0,0,0,0,0,0,0,0,0,0,0,0,0,0,0,0,0,0,0,0,0,0,0,0,0,0]
[null,"Menge/ha"]
[null,"Bemerkung"]
[null,"Datum"]
[null,"Dünger 7"]
[null,"Preis",{"$f":"IF(C38=\"\",0,VLOOKUP(C38,Düngemittel,3,FALSE))","v":0},0,0,0,0,0,0,0,0,0,0,0,0,0,0,0,0,0,0,0,0,0,0,0,0,0,0,0,0,0,0,0,{"$f":"IF(AI38=\"\",0,VLOOKUP(AI38,Düngemittel,3,FALSE))","v":0},0,0,0,0,0,0,0,0,0,0,0,0,0,0,0,0,0,0,0,0,0,0,0,0,0,0,0]
[null,"Menge/ha"]
[null,"Bemerkung"]
[null,"Datum"]
[null,"Dünger 8"]
[null,"Preis",{"$f":"IF(C43=\"\",0,VLOOKUP(C43,Düngemittel,3,FALSE))","v":0},0,0,0,0,0,0,0,0,0,0,0,0,0,0,0,0,0,0,0,0,0,0,0,0,0,0,0,0,0,0,0,{"$f":"IF(AI43=\"\",0,VLOOKUP(AI43,Düngemittel,3,FALSE))","v":0},0,0,0,0,0,0,0,0,0,0,0,0,0,0,0,0,0,0,0,0,0,0,0,0,0,0,0]
[null,"Menge/ha"]
[null,"Bemerkung"]
[null,"Datum "]
[null,"Dünger 9"]
[null,"Preis",{"$f":"IF(C48=\"\",0,VLOOKUP(C48,Düngemittel,3,FALSE))","v":0},0,0,0,0,0,0,0,0,0,0,0,0,0,0,0,0,0,0,0,0,0,0,0,0,0,0,0,0,0,0,0,{"$f":"IF(AI48=\"\",0,VLOOKUP(AI48,Düngemittel,3,FALSE))","v":0},0,0,0,0,0,0,0,0,0,0,0,0,0,0,0,0,0,0,0,0,0,0,0,0,0,0,0]
[null,"Menge/ha"]
[null,"Bemerkung"]
[null,"Datum "]
[null,"Dünger 10"]
[null,"Preis",{"$f":"IF(C53=\"\",0,VLOOKUP(C53,Düngemittel,3,FALSE))","v":0},0,0,0,0,0,0,0,0,0,0,0,0,0,0,0,0,0,0,0,0,0,0,0,0,0,0,0,0,0,0,0,{"$f":"IF(AI53=\"\",0,VLOOKUP(AI53,Düngemittel,3,FALSE))","v":0},0,0,0,0,0,0,0,0,0,0,0,0,0,0,0,0,0,0,0,0,0,0,0,0,0,0,0]
[null,"Menge/ha"]
[null,"Bemerkung"]
[null,"Datum "]
[null,"Dünger 11"]
[null,"Preis",{"$f":"IF(C58=\"\",0,VLOOKUP(C58,Düngemittel,3,FALSE))","v":0},0,0,0,0,0,0,0,0,0,0,0,0,0,0,0,0,0,0,0,0,0,0,0,0,0,0,0,0,0,0,0,{"$f":"IF(AI58=\"\",0,VLOOKUP(AI58,Düngemittel,3,FALSE))","v":0},0,0,0,0,0,0,0,0,0,0,0,0,0,0,0,0,0,0,0,0,0,0,0,0,0,0,0]
[null,"Menge/ha"]
[null,"Bemerkung"]
[null,"Datum"]
[null,"Dünger 12"]
[null,"Preis",{"$f":"IF(C63=\"\",0,VLOOKUP(C63,Düngemittel,3,FALSE))","v":0},0,0,0,0,0,0,0,0,0,0,0,0,0,0,0,0,0,0,0,0,0,0,0,0,0,0,0,0,0,0,0,{"$f":"IF(AI63=\"\",0,VLOOKUP(AI63,Düngemittel,3,FALSE))","v":0},0,0,0,0,0,0,0,0,0,0,0,0,0,0,0,0,0,0,0,0,0,0,0,0,0,0,0]
[null,"Menge/ha"]
[null,"Bemerkung"]
[null,"Datum "]
[null,"Dünger 13"]
[null,"Preis",{"$f":"IF(C68=\"\",0,VLOOKUP(C68,Düngemittel,3,FALSE))","v":0},0,0,0,0,0,0,0,0,0,0,0,0,0,0,0,0,0,0,0,0,0,0,0,0,0,0,0,0,0,0,0,{"$f":"IF(AI68=\"\",0,VLOOKUP(AI68,Düngemittel,3,FALSE))","v":0},0,0,0,0,0,0,0,0,0,0,0,0,0,0,0,0,0,0,0,0,0,0,0,0,0,0,0]
[null,"Menge/ha"]
[null,"Bemerkung"]
[null,"Datum"]
[null,"Dünger 14"]
[null,"Preis",{"$f":"IF(C73=\"\",0,VLOOKUP(C73,Düngemittel,3,FALSE))","v":0},0,0,0,0,0,0,0,0,0,0,0,0,0,0,0,0,0,0,0,0,0,0,0,0,0,0,0,0,0,0,0,{"$f":"IF(AI73=\"\",0,VLOOKUP(AI73,Düngemittel,3,FALSE))","v":0},0,0,0,0,0,0,0,0,0,0,0,0,0,0,0,0,0,0,0,0,0,0,0,0,0,0,0]
[null,"Menge/ha"]
[null,"Bemerkung"]
[null,"Datum"]
[null,"Dünger 15"]
[null,"Preis",{"$f":"IF(C78=\"\",0,VLOOKUP(C78,Düngemittel,3,FALSE))","v":0},0,0,0,0,0,0,0,0,0,0,0,0,0,0,0,0,0,0,0,0,0,0,0,0,0,0,0,0,0,0,0,{"$f":"IF(AI78=\"\",0,VLOOKUP(AI78,Düngemittel,3,FALSE))","v":0},0,0,0,0,0,0,0,0,0,0,0,0,0,0,0,0,0,0,0,0,0,0,0,0,0,0,0]
[null,"Menge/ha"]
[null,"Bemerkung"]
[null,"Datum"]
[null,"Dünger 16"]
[null,"Preis",{"$f":"IF(C83=\"\",0,VLOOKUP(C83,Düngemittel,3,FALSE))","v":0},0,0,0,0,0,0,0,0,0,0,0,0,0,0,0,0,0,0,0,0,0,0,0,0,0,0,0,0,0,0,0,{"$f":"IF(AI83=\"\",0,VLOOKUP(AI83,Düngemittel,3,FALSE))","v":0},0,0,0,0,0,0,0,0,0,0,0,0,0,0,0,0,0,0,0,0,0,0,0,0,0,0,0]
[null,"Menge/ha"]
[null,"Bemerkung"]
[null,"Datum"]
[null,"Dünger 17"]
[null,"Preis",{"$f":"IF(C88=\"\",0,VLOOKUP(C88,Düngemittel,3,FALSE))","v":0},0,0,0,0,0,0,0,0,0,0,0,0,0,0,0,0,0,0,0,0,0,0,0,0,0,0,0,0,0,0,0,{"$f":"IF(AI88=\"\",0,VLOOKUP(AI88,Düngemittel,3,FALSE))","v":0},0,0,0,0,0,0,0,0,0,0,0,0,0,0,0,0,0,0,0,0,0,0,0,0,0,0,0]
[null,"Menge/ha"]
[null,"Bemerkung"]
[null,"Datum"]
[null,"Dünger 18"]
[null,"Preis",{"$f":"IF(C93=\"\",0,VLOOKUP(C93,Düngemittel,3,FALSE))","v":0},0,0,0,0,0,0,0,0,0,0,0,0,0,0,0,0,0,0,0,0,0,0,0,0,0,0,0,0,0,0,0,{"$f":"IF(AI93=\"\",0,VLOOKUP(AI93,Düngemittel,3,FALSE))","v":0},0,0,0,0,0,0,0,0,0,0,0,0,0,0,0,0,0,0,0,0,0,0,0,0,0,0,0]
[null,"Menge/ha"]
[null,"Bemerkung"]
[null,"Datum"]
[null,"Dünger 19"]
[null,"Preis",{"$f":"IF(C98=\"\",0,VLOOKUP(C98,Düngemittel,3,FALSE))","v":0},0,0,0,0,0,0,0,0,0,0,0,0,0,0,0,0,0,0,0,0,0,0,0,0,0,0,0,0,0,0,0,{"$f":"IF(AI98=\"\",0,VLOOKUP(AI98,Düngemittel,3,FALSE))","v":0},0,0,0,0,0,0,0,0,0,0,0,0,0,0,0,0,0,0,0,0,0,0,0,0,0,0,0]
[null,"Menge/ha"]
[null,"Bemerkung"]
[null,"Datum"]
[null,"Dünger 20"]
[null,"Preis",{"$f":"IF(C103=\"\",0,VLOOKUP(C103,Düngemittel,3,FALSE))","v":0},0,0,0,0,0,0,0,0,0,0,0,0,0,0,0,0,0,0,0,0,0,0,0,0,0,0,0,0,0,0,0,{"$f":"IF(AI103=\"\",0,VLOOKUP(AI103,Düngemittel,3,FALSE))","v":0},0,0,0,0,0,0,0,0,0,0,0,0,0,0,0,0,0,0,0,0,0,0,0,0,0,0,0]
[null,"Menge/ha"]
[null,"Bemerkung"]
[null,"Datum "]
[null,"Dünger 21"]
[null,"Preis",{"$f":"IF(C108=\"\",0,VLOOKUP(C108,Düngemittel,3,FALSE))","v":0},0,0,0,0,0,0,0,0,0,0,0,0,0,0,0,0,0,0,0,0,0,0,0,0,0,0,0,0,0,0,0,{"$f":"IF(AI108=\"\",0,VLOOKUP(AI108,Düngemittel,3,FALSE))","v":0},0,0,0,0,0,0,0,0,0,0,0,0,0,0,0,0,0,0,0,0,0,0,0,0,0,0,0]
[null,"Menge/ha"]
[null,"Bemerkung"]
[null,"Datum "]
[null,"Dünger 22"]
[null,"Preis",{"$f":"IF(C113=\"\",0,VLOOKUP(C113,Düngemittel,3,FALSE))","v":0},0,0,0,0,0,0,0,0,0,0,0,0,0,0,0,0,0,0,0,0,0,0,0,0,0,0,0,0,0,0,0,{"$f":"IF(AI113=\"\",0,VLOOKUP(AI113,Düngemittel,3,FALSE))","v":0},0,0,0,0,0,0,0,0,0,0,0,0,0,0,0,0,0,0,0,0,0,0,0,0,0,0,0]
[null,"Menge/ha"]
[null,"Bemerkung"]
[null,"Datum"]
[null,"Dünger 23"]
[null,"Preis",{"$f":"IF(C118=\"\",0,VLOOKUP(C118,Düngemittel,3,FALSE))","v":0},0,0,0,0,0,0,0,0,0,0,0,0,0,0,0,0,0,0,0,0,0,0,0,0,0,0,0,0,0,0,0,{"$f":"IF(AI118=\"\",0,VLOOKUP(AI118,Düngemittel,3,FALSE))","v":0},0,0,0,0,0,0,0,0,0,0,0,0,0,0,0,0,0,0,0,0,0,0,0,0,0,0,0]
[null,"Menge/ha"]
[null,"Bemerkung"]
[null,"Datum "]
[null,"Dünger 24"]
[null,"Preis",{"$f":"IF(C123=\"\",0,VLOOKUP(C123,Düngemittel,3,FALSE))","v":0},0,0,0,0,0,0,0,0,0,0,0,0,0,0,0,0,0,0,0,0,0,0,0,0,0,0,0,0,0,0,0,{"$f":"IF(AI123=\"\",0,VLOOKUP(AI123,Düngemittel,3,FALSE))","v":0},0,0,0,0,0,0,0,0,0,0,0,0,0,0,0,0,0,0,0,0,0,0,0,0,0,0,0]
[null,"Menge/ha"]
[null,"Bemerkung"]
[null,"Datum"]
[null,"Dünger 25"]
[null,"Preis",{"$f":"IF(C128=\"\",0,VLOOKUP(C128,Düngemittel,3,FALSE))","v":0},0,0,0,0,0,0,0,0,0,0,0,0,0,0,0,0,0,0,0,0,0,0,0,0,0,0,0,0,0,0,0,{"$f":"IF(AI128=\"\",0,VLOOKUP(AI128,Düngemittel,3,FALSE))","v":0},0,0,0,0,0,0,0,0,0,0,0,0,0,0,0,0,0,0,0,0,0,0,0,0,0,0,0]
[null,"Menge/ha"]
[null,"Bemerkung"]
[null,"Datum"]
[null,"Dünger 26"]
[null,"Preis",{"$f":"IF(C133=\"\",0,VLOOKUP(C133,Düngemittel,3,FALSE))","v":0},0,0,0,0,0,0,0,0,0,0,0,0,0,0,0,0,0,0,0,0,0,0,0,0,0,0,0,0,0,0,0,{"$f":"IF(AI133=\"\",0,VLOOKUP(AI133,Düngemittel,3,FALSE))","v":0},0,0,0,0,0,0,0,0,0,0,0,0,0,0,0,0,0,0,0,0,0,0,0,0,0,0,0]
[null,"Menge/ha"]
[null,"Bemerkung"]
[null,"Datum"]
[null,"Dünger 27"]
[null,"Preis",{"$f":"IF(C138=\"\",0,VLOOKUP(C138,Düngemittel,3,FALSE))","v":0},0,0,0,0,0,0,0,0,0,0,0,0,0,0,0,0,0,0,0,0,0,0,0,0,0,0,0,0,0,0,0,{"$f":"IF(AI138=\"\",0,VLOOKUP(AI138,Düngemittel,3,FALSE))","v":0},0,0,0,0,0,0,0,0,0,0,0,0,0,0,0,0,0,0,0,0,0,0,0,0,0,0,0]
[null,"Menge/ha"]
[null,"Bemerkung"]
[null,"Datum"]
[null,"Dünger 28"]
[null,"Preis",{"$f":"IF(C143=\"\",0,VLOOKUP(C143,Düngemittel,3,FALSE))","v":0},0,0,0,0,0,0,0,0,0,0,0,0,0,0,0,0,0,0,0,0,0,0,0,0,0,0,0,0,0,0,0,{"$f":"IF(AI143=\"\",0,VLOOKUP(AI143,Düngemittel,3,FALSE))","v":0},0,0,0,0,0,0,0,0,0,0,0,0,0,0,0,0,0,0,0,0,0,0,0,0,0,0,0]
[null,"Menge/ha"]
[null,"Bemerkung"]
[null,"Datum"]
[null,"Dünger 29"]
[null,"Preis",{"$f":"IF(C148=\"\",0,VLOOKUP(C148,Düngemittel,3,FALSE))","v":0},0,0,0,0,0,0,0,0,0,0,0,0,0,0,0,0,0,0,0,0,0,0,0,0,0,0,0,0,0,0,0,{"$f":"IF(AI148=\"\",0,VLOOKUP(AI148,Düngemittel,3,FALSE))","v":0},0,0,0,0,0,0,0,0,0,0,0,0,0,0,0,0,0,0,0,0,0,0,0,0,0,0,0]
[null,"Menge/ha"]
[null,"Bemerkung"]
[null,"Datum"]
[null,"Dünger 30"]
[null,"Preis",{"$f":"IF(C153=\"\",0,VLOOKUP(C153,Düngemittel,3,FALSE))","v":0},0,0,0,0,0,0,0,0,0,0,0,0,0,0,0,0,0,0,0,0,0,0,0,0,0,0,0,0,0,0,0,{"$f":"IF(AI153=\"\",0,VLOOKUP(AI153,Düngemittel,3,FALSE))","v":0},0,0,0,0,0,0,0,0,0,0,0,0,0,0,0,0,0,0,0,0,0,0,0,0,0,0,0]
[null,"Menge/ha"]
[null,"Bemerkung"]
[null,"Datum"]
[null,"Dünger 31"]
[null,"Preis",{"$f":"IF(C158=\"\",0,VLOOKUP(C158,Düngemittel,3,FALSE))","v":0},0,0,0,0,0,0,0,0,0,0,0,0,0,0,0,0,0,0,0,0,0,0,0,0,0,0,0,0,0,0,0,{"$f":"IF(AI158=\"\",0,VLOOKUP(AI158,Düngemittel,3,FALSE))","v":0},0,0,0,0,0,0,0,0,0,0,0,0,0,0,0,0,0,0,0,0,0,0,0,0,0,0,0]
[null,"Menge/ha"]
[null,"Bemerkung"]
[null,"€/ha",{"$f":"C9*C10+C14*C15+C19*C20+C24*C25+C29*C30+C34*C35+C39*C40+C44*C45+C49*C50+C54*C55+C59*C60+C64*C65+C69*C70+C74*C75+C79*C80+C84*C85+C89*C90+C99*C100","v":99.125},{"$f":"D9*D10+D14*D15+D19*D20+D24*D25+D29*D30+D34*D35+D39*D40+D44*D45+D49*D50+D54*D55+D59*D60+D64*D65+D69*D70+D74*D75+D79*D80+D84*D85+D89*D90+D99*D100","v":0},0,0,0,0,0,0,0,0,0,0,0,0,0,0,0,0,0,0,0,0,0,0,0,0,0,0,0,0,0,0,0,0,0,0,0,0,0,0,0,0,0,0,0,0,0,0,0,0,0,0,0,0,0,0,0,0,0,0]
[null,"€/gesamt",{"$f":"C162*C6","v":376.67499999999995},{"$f":"D162*D6","v":0},0,0,0,0,0,0,0,0,0,0,0,0,0,0,0,0,0,0,{"$f":"W162*W6","v":0},0,0,0,0,0,0,0,0,0,{"$f":"AG162*AG6","v":0},0,0,0,0,0,0,0,0,0,0,0,0,0,0,0,0,0,0,0,0,0,0,0,0,0,0,0,0,0,{"$f":"SUM(C163:BJ163)","v":376.67499999999995}]
[]
[]
[]
[]
[null,"Düngebilanz"]
[null,"N- Düngebedarf",28]
[null," - N-min",{"$f":"IF(Betriebsdaten!C37=\"\",0,Betriebsdaten!C37)","v":52},{"$f":"IF(Betriebsdaten!D37=\"\",0,Betriebsdaten!D37)","v":0},{"$f":"IF(Betriebsdaten!E37=\"\",0,Betriebsdaten!E37)","v":0},{"$f":"IF(Betriebsdaten!F37=\"\",0,Betriebsdaten!F37)","v":0},{"$f":"IF(Betriebsdaten!G37=\"\",0,Betriebsdaten!G37)","v":0},{"$f":"IF(Betriebsdaten!H37=\"\",0,Betriebsdaten!H37)","v":0},{"$f":"IF(Betriebsdaten!I37=\"\",0,Betriebsdaten!I37)","v":0},{"$f":"IF(Betriebsdaten!J37=\"\",0,Betriebsdaten!J37)","v":0},{"$f":"IF(Betriebsdaten!K37=\"\",0,Betriebsdaten!K37)","v":0},{"$f":"IF(Betriebsdaten!L37=\"\",0,Betriebsdaten!L37)","v":0},{"$f":"IF(Betriebsdaten!M37=\"\",0,Betriebsdaten!M37)","v":0},{"$f":"IF(Betriebsdaten!N37=\"\",0,Betriebsdaten!N37)","v":0},{"$f":"IF(Betriebsdaten!O37=\"\",0,Betriebsdaten!O37)","v":0},{"$f":"IF(Betriebsdaten!K37=\"\",0,Betriebsdaten!K37)","v":0},{"$f":"IF(Betriebsdaten!Q37=\"\",0,Betriebsdaten!Q37)","v":0},{"$f":"IF(Betriebsdaten!R37=\"\",0,Betriebsdaten!R37)","v":0},{"$f":"IF(Betriebsdaten!S37=\"\",0,Betriebsdaten!S37)","v":0},{"$f":"IF(Betriebsdaten!T37=\"\",0,Betriebsdaten!T37)","v":0},{"$f":"IF(Betriebsdaten!U37=\"\",0,Betriebsdaten!U37)","v":0},{"$f":"IF(Betriebsdaten!V37=\"\",0,Betriebsdaten!V37)","v":0},{"$f":"IF(Betriebsdaten!W37=\"\",0,Betriebsdaten!W37)","v":0},{"$f":"IF(Betriebsdaten!X37=\"\",0,Betriebsdaten!X37)","v":0},{"$f":"IF(Betriebsdaten!Y37=\"\",0,Betriebsdaten!Y37)","v":0},{"$f":"IF(Betriebsdaten!Z37=\"\",0,Betriebsdaten!Z37)","v":0},{"$f":"IF(Betriebsdaten!AA37=\"\",0,Betriebsdaten!AA37)","v":0},{"$f":"IF(Betriebsdaten!AB37=\"\",0,Betriebsdaten!AB37)","v":0},{"$f":"IF(Betriebsdaten!AC37=\"\",0,Betriebsdaten!AC37)","v":0},{"$f":"IF(Betriebsdaten!AD37=\"\",0,Betriebsdaten!AD37)","v":0},{"$f":"IF(Betriebsdaten!AE37=\"\",0,Betriebsdaten!AE37)","v":0},{"$f":"IF(Betriebsdaten!AF37=\"\",0,Betriebsdaten!AF37)","v":0},{"$f":"IF(Betriebsdaten!AG37=\"\",0,Betriebsdaten!AG37)","v":0},{"$f":"IF(Betriebsdaten!AH37=\"\",0,Betriebsdaten!AH37)","v":0},{"$f":"IF(Betriebsdaten!AI37=\"\",0,Betriebsdaten!AI37)","v":0},{"$f":"IF(Betriebsdaten!AJ37=\"\",0,Betriebsdaten!AJ37)","v":0},{"$f":"IF(Betriebsdaten!AK37=\"\",0,Betriebsdaten!AK37)","v":0},{"$f":"IF(Betriebsdaten!AL37=\"\",0,Betriebsdaten!AL37)","v":0},{"$f":"IF(Betriebsdaten!AM37=\"\",0,Betriebsdaten!AM37)","v":0},{"$f":"IF(Betriebsdaten!AN37=\"\",0,Betriebsdaten!AN37)","v":0},{"$f":"IF(Betriebsdaten!AO37=\"\",0,Betriebsdaten!AO37)","v":0},{"$f":"IF(Betriebsdaten!AP37=\"\",0,Betriebsdaten!AP37)","v":0},{"$f":"IF(Betriebsdaten!AQ37=\"\",0,Betriebsdaten!AQ37)","v":0},{"$f":"IF(Betriebsdaten!AR37=\"\",0,Betriebsdaten!AR37)","v":0},{"$f":"IF(Betriebsdaten!AS37=\"\",0,Betriebsdaten!AS37)","v":0},{"$f":"IF(Betriebsdaten!AT37=\"\",0,Betriebsdaten!AT37)","v":0},{"$f":"IF(Betriebsdaten!AU37=\"\",0,Betriebsdaten!AU37)","v":0},{"$f":"IF(Betriebsdaten!AV37=\"\",0,Betriebsdaten!AV37)","v":0},{"$f":"IF(Betriebsdaten!AW37=\"\",0,Betriebsdaten!AW37)","v":0},{"$f":"IF(Betriebsdaten!AX37=\"\",0,Betriebsdaten!AX37)","v":0},{"$f":"IF(Betriebsdaten!AY37=\"\",0,Betriebsdaten!AY37)","v":0},{"$f":"IF(Betriebsdaten!AZ37=\"\",0,Betriebsdaten!AZ37)","v":0},{"$f":"IF(Betriebsdaten!BA37=\"\",0,Betriebsdaten!BA37)","v":0},{"$f":"IF(Betriebsdaten!BB37=\"\",0,Betriebsdaten!BB37)","v":0},{"$f":"IF(Betriebsdaten!BC37=\"\",0,Betriebsdaten!BC37)","v":0},{"$f":"IF(Betriebsdaten!BD37=\"\",0,Betriebsdaten!BD37)","v":0},{"$f":"IF(Betriebsdaten!BE37=\"\",0,Betriebsdaten!BE37)","v":0},{"$f":"IF(Betriebsdaten!BF37=\"\",0,Betriebsdaten!BF37)","v":0},{"$f":"IF(Betriebsdaten!BG37=\"\",0,Betriebsdaten!BG37)","v":0},{"$f":"IF(Betriebsdaten!BH37=\"\",0,Betriebsdaten!BH37)","v":0},{"$f":"IF(Betriebsdaten!BI37=\"\",0,Betriebsdaten!BI37)","v":0},{"$f":"IF(Betriebsdaten!BJ37=\"\",0,Betriebsdaten!BJ37)","v":0}]
[null," = N-Bedarf",{"$f":"IF(C169=\"\",\"\",C169-(#REF!+#REF!+#REF!+#REF!-#REF!-#REF!-#REF!-#REF!+C170))","v":{"$error":"#REF!"}},{"$f":"IF(D169=\"\",\"\",D169-D170)","v":""},"","","","","","","","","","","","","","","","","","","","","","","","","","","","","","","",{"$f":"IF(AJ169=\"\",\"\",AJ169-AJ170)","v":""},"","","","","","","","","","","","","","","","","","","","","","","","","",""]
[null,"N gedüngt",{"$f":"SUMPRODUCT($A$187:$A$247,C187:C247)","v":27},{"$f":"SUMPRODUCT($A$187:$A$247,D187:D247)","v":0},0,0,0,0,0,0,0,0,0,0,0,0,0,0,0,0,0,0,0,0,0,0,0,0,0,0,0,0,0,0,0,0,0,0,0,0,0,0,0,0,0,0,0,0,0,0,0,0,0,0,0,0,0,0,0,0,0,0]
[null," + / -",{"$f":"IF(C169=\"\",\"\",(C169-C172))","v":1},{"$f":"IF(D169=\"\",\"\",(D169-D172))","v":""},"","","","","","","","","","","","","","","","","","","","","","","","","","","","","","","","","","","","","","","","","","","","","","","","","","","","","","","","","",""]
[]
[null,"P-Düngebedarf",10]
[null,"P2O5 gedüngt",{"$f":"SUMPRODUCT($A$249:$A$309,C249:C309)","v":0},{"$f":"SUMPRODUCT($A$249:$A$309,D249:D309)","v":0},0,0,0,0,0,0,0,0,0,0,0,0,0,0,0,0,0,0,0,0,0,0,0,0,0,0,0,0,0,0,0,0,0,0,0,0,0,0,0,0,0,0,0,0,0,0,0,0,0,0,0,0,0,0,0,0,0,0]
[null," + / -",{"$f":"C176-C175","v":-10},0,0,0,0,0,0,{"$f":"J176-J175","v":0},0,0,0,0,0,0,0,0,0,0,0,0,{"$f":"W176-W175","v":0},0,0,0,0,0,0,0,0,0,{"$f":"AG176-AG175","v":0},0,0,0,0,0,0,0,0,0,0,0,0,0,0,0,0,0,0,0,0,0,0,0,0,0,0,0,0,0]
[]
[null,"K-Sollwert",120]
[null,"K2O gedüngt",{"$f":"SUMPRODUCT($A$311:$A$371,C311:C371)","v":100},{"$f":"SUMPRODUCT($A$311:$A$371,D311:D371)","v":0},0,0,0,0,0,0,0,0,0,0,0,0,0,0,0,0,0,0,0,0,0,0,0,0,0,0,0,0,0,0,0,0,0,0,0,0,0,0,0,0,0,0,0,0,0,0,0,0,0,0,0,0,0,0,0,0,0,0]
[null," + / -",{"$f":"C180-C179","v":-20},0,0,0,0,0,0,{"$f":"J180-J179","v":0},0,0,0,0,0,0,0,0,0,0,0,0,{"$f":"W180-W179","v":0},0,0,0,0,0,0,0,0,0,{"$f":"AG180-AG179","v":0},0,0,0,0,0,0,0,0,0,0,0,0,0,0,0,0,0,0,0,0,0,0,0,0,0,0,0,0,0]
[]
[]
[]
[]
[null,"N1",{"$f":"IF(C8=\"\",0,VLOOKUP(C8,Düngemittel,5,FALSE))","v":27},0,0,0,0,0,0,0,0,0,0,0,0,0,0,0,0,0,0,0,0,0,0,0,0,0,0,0,0,0,0,0,{"$f":"IF(AI8=\"\",0,VLOOKUP(AI8,Düngemittel,5,FALSE))","v":0},0,0,0,0,0,0,0,0,0,0,0,0,0,0,0,0,0,0,0,0,0,0,0,0,0,0,0]
[1,null,{"$f":"C186*C10","v":27},0,0,0,0,0,0,0,0,0,0,0,0,0,0,0,0,0,0,0,0,0,0,0,0,0,0,0,0,0,0,0,{"$f":"AI186*AI10","v":0},0,0,0,0,0,0,0,0,0,0,0,0,0,0,0,0,0,0,0,0,0,0,0,0,0,0,0]
[null,"N2",{"$f":"IF(C13=\"\",0,VLOOKUP(C13,Düngemittel,5,FALSE))","v":0},0,0,0,0,0,0,0,0,0,0,0,0,0,0,0,0,0,0,0,0,0,0,0,0,0,0,0,0,0,0,0,{"$f":"IF(AI13=\"\",0,VLOOKUP(AI13,Düngemittel,5,FALSE))","v":0},0,0,0,0,0,0,0,0,0,0,0,0,0,0,0,0,0,0,0,0,0,0,0,0,0,0,0]
[1,null,{"$f":"C188*C15","v":0},0,0,0,0,0,0,0,0,0,0,0,0,0,0,0,0,0,0,0,0,0,0,0,0,0,0,0,0,0,0,0,{"$f":"AI188*AI15","v":0},0,0,0,0,0,0,0,0,0,0,0,0,0,0,0,0,0,0,0,0,0,0,0,0,0,0,0]
[null,"N3",{"$f":"IF(C18=\"\",0,VLOOKUP(C18,Düngemittel,5,FALSE))","v":0},0,0,0,0,0,0,0,0,0,0,0,0,0,0,0,0,0,0,0,0,0,0,0,0,0,0,0,0,0,0,0,{"$f":"IF(AI18=\"\",0,VLOOKUP(AI18,Düngemittel,5,FALSE))","v":0},0,0,0,0,0,0,0,0,0,0,0,0,0,0,0,0,0,0,0,0,0,0,0,0,0,0,0]
[1,null,{"$f":"C190*C20","v":0},0,0,0,0,0,0,0,0,0,0,0,0,0,0,0,0,0,0,0,0,0,0,0,0,0,0,0,0,0,0,0,{"$f":"AI190*AI20","v":0},0,0,0,0,0,0,0,0,0,0,0,0,0,0,0,0,0,0,0,0,0,0,0,0,0,0,0]
[null,"N4",{"$f":"IF(C23=\"\",0,VLOOKUP(C23,Düngemittel,5,FALSE))","v":0},0,0,0,0,0,0,0,0,0,0,0,0,0,0,0,0,0,0,0,0,0,0,0,0,0,0,0,0,0,0,0,{"$f":"IF(AI23=\"\",0,VLOOKUP(AI23,Düngemittel,5,FALSE))","v":0},0,0,0,0,0,0,0,0,0,0,0,0,0,0,0,0,0,0,0,0,0,0,0,0,0,0,0]
[1,null,{"$f":"C192*C25","v":0},0,0,0,0,0,0,0,0,0,0,0,0,0,0,0,0,0,0,0,0,0,0,0,0,0,0,0,0,0,0,0,{"$f":"AI192*AI25","v":0},0,0,0,0,0,0,0,0,0,0,0,0,0,0,0,0,0,0,0,0,0,0,0,0,0,0,0]
[null,"N5",{"$f":"IF(C28=\"\",0,VLOOKUP(C28,Düngemittel,5,FALSE))","v":0},0,0,0,0,0,0,0,0,0,0,0,0,0,0,0,0,0,0,0,0,0,0,0,0,0,0,0,0,0,0,0,{"$f":"IF(AI28=\"\",0,VLOOKUP(AI28,Düngemittel,5,FALSE))","v":0},0,0,0,0,0,0,0,0,0,0,0,0,0,0,0,0,0,0,0,0,0,0,0,0,0,0,0]
[1,null,{"$f":"C194*C30","v":0},0,0,0,0,0,0,0,0,0,0,0,0,0,0,0,0,0,0,0,0,0,0,0,0,0,0,0,0,0,0,0,{"$f":"AI194*AI30","v":0},0,0,0,0,0,0,0,0,0,0,0,0,0,0,0,0,0,0,0,0,0,0,0,0,0,0,0]
[null,"N6",{"$f":"IF(C33=\"\",0,VLOOKUP(C33,Düngemittel,5,FALSE))","v":0},0,0,0,0,0,0,0,0,0,0,0,0,0,0,0,0,0,0,0,0,0,0,0,0,0,0,0,0,0,0,0,{"$f":"IF(AI33=\"\",0,VLOOKUP(AI33,Düngemittel,5,FALSE))","v":0},0,0,0,0,0,0,0,0,0,0,0,0,0,0,0,0,0,0,0,0,0,0,0,0,0,0,0]
[1,null,{"$f":"C196*C35","v":0},0,0,0,0,0,0,0,0,0,0,0,0,0,0,0,0,0,0,0,0,0,0,0,0,0,0,0,0,0,0,0,{"$f":"AI196*AI35","v":0},0,0,0,0,0,0,0,0,0,0,0,0,0,0,0,0,0,0,0,0,0,0,0,0,0,0,0]
[null,"N7",{"$f":"IF(C38=\"\",0,VLOOKUP(C38,Düngemittel,5,FALSE))","v":0},0,0,0,0,0,0,0,0,0,0,0,0,0,0,0,0,0,0,0,0,0,0,0,0,0,0,0,0,0,0,0,{"$f":"IF(AI38=\"\",0,VLOOKUP(AI38,Düngemittel,5,FALSE))","v":0},0,0,0,0,0,0,0,0,0,0,0,0,0,0,0,0,0,0,0,0,0,0,0,0,0,0,0]
[1,null,{"$f":"C198*C40","v":0},0,0,0,0,0,0,0,0,0,0,0,0,0,0,0,0,0,0,0,0,0,0,0,0,0,0,0,0,0,0,0,{"$f":"AI198*AI40","v":0},0,0,0,0,0,0,0,0,0,0,0,0,0,0,0,0,0,0,0,0,0,0,0,0,0,0,0]
[null,"N8",{"$f":"IF(C43=\"\",0,VLOOKUP(C43,Düngemittel,5,FALSE))","v":0},0,0,0,0,0,0,0,0,0,0,0,0,0,0,0,0,0,0,0,0,0,0,0,0,0,0,0,0,0,0,0,{"$f":"IF(AI43=\"\",0,VLOOKUP(AI43,Düngemittel,5,FALSE))","v":0},0,0,0,0,0,0,0,0,0,0,0,0,0,0,0,0,0,0,0,0,0,0,0,0,0,0,0]
[1,null,{"$f":"C200*C45","v":0},0,0,0,0,0,0,0,0,0,0,0,0,0,0,0,0,0,0,0,0,0,0,0,0,0,0,0,0,0,0,0,{"$f":"AI200*AI45","v":0},0,0,0,0,0,0,0,0,0,0,0,0,0,0,0,0,0,0,0,0,0,0,0,0,0,0,0]
[null,"N9",{"$f":"IF(C48=\"\",0,VLOOKUP(C48,Düngemittel,5,FALSE))","v":0},0,0,0,0,0,0,0,0,0,0,0,0,0,0,0,0,0,0,0,0,0,0,0,0,0,0,0,0,0,0,0,{"$f":"IF(AI48=\"\",0,VLOOKUP(AI48,Düngemittel,5,FALSE))","v":0},0,0,0,0,0,0,0,0,0,0,0,0,0,0,0,0,0,0,0,0,0,0,0,0,0,0,0]
[1,null,{"$f":"C202*C50","v":0},0,0,0,0,0,0,0,0,0,0,0,0,0,0,0,0,0,0,0,0,0,0,0,0,0,0,0,0,0,0,0,{"$f":"AI202*AI50","v":0},0,0,0,0,0,0,0,0,0,0,0,0,0,0,0,0,0,0,0,0,0,0,0,0,0,0,0]
[null,"N10",{"$f":"IF(C53=\"\",0,VLOOKUP(C53,Düngemittel,5,FALSE))","v":0},0,0,0,0,0,0,0,0,0,0,0,0,0,0,0,0,0,0,0,0,0,0,0,0,0,0,0,0,0,0,0,{"$f":"IF(AI53=\"\",0,VLOOKUP(AI53,Düngemittel,5,FALSE))","v":0},0,0,0,0,0,0,0,0,0,0,0,0,0,0,0,0,0,0,0,0,0,0,0,0,0,0,0]
[1,null,{"$f":"C204*C55","v":0},0,0,0,0,0,0,0,0,0,0,0,0,0,0,0,0,0,0,0,0,0,0,0,0,0,0,0,0,0,0,0,{"$f":"AI204*AI55","v":0},0,0,0,0,0,0,0,0,0,0,0,0,0,0,0,0,0,0,0,0,0,0,0,0,0,0,0]
[null,"N11",{"$f":"IF(C58=\"\",0,VLOOKUP(C58,Düngemittel,5,FALSE))","v":0},0,0,0,0,0,0,0,0,0,0,0,0,0,0,0,0,0,0,0,0,0,0,0,0,0,0,0,0,0,0,0,{"$f":"IF(AI58=\"\",0,VLOOKUP(AI58,Düngemittel,5,FALSE))","v":0},0,0,0,0,0,0,0,0,0,0,0,0,0,0,0,0,0,0,0,0,0,0,0,0,0,0,0]
[1,null,{"$f":"C206*C60","v":0},0,0,0,0,0,0,0,0,0,0,0,0,0,0,0,0,0,0,0,0,0,0,0,0,0,0,0,0,0,0,0,{"$f":"AI206*AI60","v":0},0,0,0,0,0,0,0,0,0,0,0,0,0,0,0,0,0,0,0,0,0,0,0,0,0,0,0]
[null,"N12",{"$f":"IF(C63=\"\",0,VLOOKUP(C63,Düngemittel,5,FALSE))","v":0},0,0,0,0,0,0,0,0,0,0,0,0,0,0,0,0,0,0,0,0,0,0,0,0,0,0,0,0,0,0,0,{"$f":"IF(AI63=\"\",0,VLOOKUP(AI63,Düngemittel,5,FALSE))","v":0},0,0,0,0,0,0,0,0,0,0,0,0,0,0,0,0,0,0,0,0,0,0,0,0,0,0,0]
[1,null,{"$f":"C208*C65","v":0},0,0,0,0,0,0,0,0,0,0,0,0,0,0,0,0,0,0,0,0,0,0,0,0,0,0,0,0,0,0,0,{"$f":"AI208*AI65","v":0},0,0,0,0,0,0,0,0,0,0,0,0,0,0,0,0,0,0,0,0,0,0,0,0,0,0,0]
[null,"N13",{"$f":"IF(C68=\"\",0,VLOOKUP(C68,Düngemittel,5,FALSE))","v":0},0,0,0,0,0,0,0,0,0,0,0,0,0,0,0,0,0,0,0,0,0,0,0,0,0,0,0,0,0,0,0,{"$f":"IF(AI68=\"\",0,VLOOKUP(AI68,Düngemittel,5,FALSE))","v":0},0,0,0,0,0,0,0,0,0,0,0,0,0,0,0,0,0,0,0,0,0,0,0,0,0,0,0]
[1,null,{"$f":"C210*C70","v":0},0,0,0,0,0,0,0,0,0,0,0,0,0,0,0,0,0,0,0,0,0,0,0,0,0,0,0,0,0,0,0,{"$f":"AI210*AI70","v":0},0,0,0,0,0,0,0,0,0,0,0,0,0,0,0,0,0,0,0,0,0,0,0,0,0,0,0]
[null,"N14",{"$f":"IF(C73=\"\",0,VLOOKUP(C73,Düngemittel,5,FALSE))","v":0},0,0,0,0,0,0,0,0,0,0,0,0,0,0,0,0,0,0,0,0,0,0,0,0,0,0,0,0,0,0,0,{"$f":"IF(AI73=\"\",0,VLOOKUP(AI73,Düngemittel,5,FALSE))","v":0},0,0,0,0,0,0,0,0,0,0,0,0,0,0,0,0,0,0,0,0,0,0,0,0,0,0,0]
[1,null,{"$f":"C212*C75","v":0},0,0,0,0,0,0,0,0,0,0,0,0,0,0,0,0,0,0,0,0,0,0,0,0,0,0,0,0,0,0,0,{"$f":"AI212*AI75","v":0},0,0,0,0,0,0,0,0,0,0,0,0,0,0,0,0,0,0,0,0,0,0,0,0,0,0,0]
[null,"N15",{"$f":"IF(C78=\"\",0,VLOOKUP(C78,Düngemittel,5,FALSE))","v":0},0,0,0,0,0,0,0,0,0,0,0,0,0,0,0,0,0,0,0,0,0,0,0,0,0,0,0,0,0,0,0,{"$f":"IF(AI78=\"\",0,VLOOKUP(AI78,Düngemittel,5,FALSE))","v":0},0,0,0,0,0,0,0,0,0,0,0,0,0,0,0,0,0,0,0,0,0,0,0,0,0,0,0]
[1,null,{"$f":"C214*C80","v":0},0,0,0,0,0,0,0,0,0,0,0,0,0,0,0,0,0,0,0,0,0,0,0,0,0,0,0,0,0,0,0,{"$f":"AI214*AI80","v":0},0,0,0,0,0,0,0,0,0,0,0,0,0,0,0,0,0,0,0,0,0,0,0,0,0,0,0]
[null,"N16",{"$f":"IF(C83=\"\",0,VLOOKUP(C83,Düngemittel,5,FALSE))","v":0},0,0,0,0,0,0,0,0,0,0,0,0,0,0,0,0,0,0,0,0,0,0,0,0,0,0,0,0,0,0,0,{"$f":"IF(AI83=\"\",0,VLOOKUP(AI83,Düngemittel,5,FALSE))","v":0},0,0,0,0,0,0,0,0,0,0,0,0,0,0,0,0,0,0,0,0,0,0,0,0,0,0,0]
[1,null,{"$f":"C216*C85","v":0},0,0,0,0,0,0,0,0,0,0,0,0,0,0,0,0,0,0,0,0,0,0,0,0,0,0,0,0,0,0,0,{"$f":"AI216*AI85","v":0},0,0,0,0,0,0,0,0,0,0,0,0,0,0,0,0,0,0,0,0,0,0,0,0,0,0,0]
[null,"N17",{"$f":"IF(C88=\"\",0,VLOOKUP(C88,Düngemittel,5,FALSE))","v":0},0,0,0,0,0,0,0,0,0,0,0,0,0,0,0,0,0,0,0,0,0,0,0,0,0,0,0,0,0,0,0,{"$f":"IF(AI88=\"\",0,VLOOKUP(AI88,Düngemittel,5,FALSE))","v":0},0,0,0,0,0,0,0,0,0,0,0,0,0,0,0,0,0,0,0,0,0,0,0,0,0,0,0]
[1,null,{"$f":"C218*C90","v":0},0,0,0,0,0,0,0,0,0,0,0,0,0,0,0,0,0,0,0,0,0,0,0,0,0,0,0,0,0,0,0,{"$f":"AI218*AI90","v":0},0,0,0,0,0,0,0,0,0,0,0,0,0,0,0,0,0,0,0,0,0,0,0,0,0,0,0]
[null,"N18",{"$f":"IF(C93=\"\",0,VLOOKUP(C93,Düngemittel,5,FALSE))","v":0},0,0,0,0,0,0,0,0,0,0,0,0,0,0,0,0,0,0,0,0,0,0,0,0,0,0,0,0,0,0,0,{"$f":"IF(AI93=\"\",0,VLOOKUP(AI93,Düngemittel,5,FALSE))","v":0},0,0,0,0,0,0,0,0,0,0,0,0,0,0,0,0,0,0,0,0,0,0,0,0,0,0,0]
[1,null,{"$f":"C220*C95","v":0},0,0,0,0,0,0,0,0,0,0,0,0,0,0,0,0,0,0,0,0,0,0,0,0,0,0,0,0,0,0,0,{"$f":"AI220*AI95","v":0},0,0,0,0,0,0,0,0,0,0,0,0,0,0,0,0,0,0,0,0,0,0,0,0,0,0,0]
[null,"N19",{"$f":"IF(C98=\"\",0,VLOOKUP(C98,Düngemittel,5,FALSE))","v":0},0,0,0,0,0,0,0,0,0,0,0,0,0,0,0,0,0,0,0,0,0,0,0,0,0,0,0,0,0,0,0,{"$f":"IF(AI98=\"\",0,VLOOKUP(AI98,Düngemittel,5,FALSE))","v":0},0,0,0,0,0,0,0,0,0,0,0,0,0,0,0,0,0,0,0,0,0,0,0,0,0,0,0]
[1,null,{"$f":"C222*C100","v":0},0,0,0,0,0,0,0,0,0,0,0,0,0,0,0,0,0,0,0,0,0,0,0,0,0,0,0,0,0,0,0,{"$f":"AI222*AI100","v":0},0,0,0,0,0,0,0,0,0,0,0,0,0,0,0,0,0,0,0,0,0,0,0,0,0,0,0]
[null,"N20",{"$f":"IF(C103=\"\",0,VLOOKUP(C103,Düngemittel,5,FALSE))","v":0},0,0,0,0,0,0,0,0,0,0,0,0,0,0,0,0,0,0,0,0,0,0,0,0,0,0,0,0,0,0,0,{"$f":"IF(AI103=\"\",0,VLOOKUP(AI103,Düngemittel,5,FALSE))","v":0},0,0,0,0,0,0,0,0,0,0,0,0,0,0,0,0,0,0,0,0,0,0,0,0,0,0,0]
[1,null,{"$f":"C224*C105","v":0},0,0,0,0,0,0,0,0,0,0,0,0,0,0,0,0,0,0,0,0,0,0,0,0,0,0,0,0,0,0,0,{"$f":"AI224*AI105","v":0},0,0,0,0,0,0,0,0,0,0,0,0,0,0,0,0,0,0,0,0,0,0,0,0,0,0,0]
[null,"N21",{"$f":"IF(C108=\"\",0,VLOOKUP(C108,Düngemittel,5,FALSE))","v":0},0,0,0,0,0,0,0,0,0,0,0,0,0,0,0,0,0,0,0,0,0,0,0,0,0,0,0,0,0,0,0,{"$f":"IF(AI108=\"\",0,VLOOKUP(AI108,Düngemittel,5,FALSE))","v":0},0,0,0,0,0,0,0,0,0,0,0,0,0,0,0,0,0,0,0,0,0,0,0,0,0,0,0]
[1,null,{"$f":"C226*C110","v":0},0,0,0,0,0,0,0,0,0,0,0,0,0,0,0,0,0,0,0,0,0,0,0,0,0,0,0,0,0,0,0,{"$f":"AI226*AI110","v":0},0,0,0,0,0,0,0,0,0,0,0,0,0,0,0,0,0,0,0,0,0,0,0,0,0,0,0]
[null,"N22",{"$f":"IF(C113=\"\",0,VLOOKUP(C113,Düngemittel,5,FALSE))","v":0},0,0,0,0,0,0,0,0,0,0,0,0,0,0,0,0,0,0,0,0,0,0,0,0,0,0,0,0,0,0,0,{"$f":"IF(AI113=\"\",0,VLOOKUP(AI113,Düngemittel,5,FALSE))","v":0},0,0,0,0,0,0,0,0,0,0,0,0,0,0,0,0,0,0,0,0,0,0,0,0,0,0,0]
[1,null,{"$f":"C228*C115","v":0},0,0,0,0,0,0,0,0,0,0,0,0,0,0,0,0,0,0,0,0,0,0,0,0,0,0,0,0,0,0,0,{"$f":"AI228*AI115","v":0},0,0,0,0,0,0,0,0,0,0,0,0,0,0,0,0,0,0,0,0,0,0,0,0,0,0,0]
[null,"N23",{"$f":"IF(C118=\"\",0,VLOOKUP(C118,Düngemittel,5,FALSE))","v":0},0,0,0,0,0,0,0,0,0,0,0,0,0,0,0,0,0,0,0,0,0,0,0,0,0,0,0,0,0,0,0,{"$f":"IF(AI118=\"\",0,VLOOKUP(AI118,Düngemittel,5,FALSE))","v":0},0,0,0,0,0,0,0,0,0,0,0,0,0,0,0,0,0,0,0,0,0,0,0,0,0,0,0]
[1,null,{"$f":"C230*C120","v":0},0,0,0,0,0,0,0,0,0,0,0,0,0,0,0,0,0,0,0,0,0,0,0,0,0,0,0,0,0,0,0,{"$f":"AI230*AI120","v":0},0,0,0,0,0,0,0,0,0,0,0,0,0,0,0,0,0,0,0,0,0,0,0,0,0,0,0]
[null,"N24",{"$f":"IF(C123=\"\",0,VLOOKUP(C123,Düngemittel,5,FALSE))","v":0},0,0,0,0,0,0,0,0,0,0,0,0,0,0,0,0,0,0,0,0,0,0,0,0,0,0,0,0,0,0,0,{"$f":"IF(AI123=\"\",0,VLOOKUP(AI123,Düngemittel,5,FALSE))","v":0},0,0,0,0,0,0,0,0,0,0,0,0,0,0,0,0,0,0,0,0,0,0,0,0,0,0,0]
[1,null,{"$f":"C232*C125","v":0},0,0,0,0,0,0,0,0,0,0,0,0,0,0,0,0,0,0,0,0,0,0,0,0,0,0,0,0,0,0,0,{"$f":"AI232*AI125","v":0},0,0,0,0,0,0,0,0,0,0,0,0,0,0,0,0,0,0,0,0,0,0,0,0,0,0,0]
[null,"N25",{"$f":"IF(C128=\"\",0,VLOOKUP(C128,Düngemittel,5,FALSE))","v":0},0,0,0,0,0,0,0,0,0,0,0,0,0,0,0,0,0,0,0,0,0,0,0,0,0,0,0,0,0,0,0,{"$f":"IF(AI128=\"\",0,VLOOKUP(AI128,Düngemittel,5,FALSE))","v":0},0,0,0,0,0,0,0,0,0,0,0,0,0,0,0,0,0,0,0,0,0,0,0,0,0,0,0]
[1,null,{"$f":"C234*C130","v":0},0,0,0,0,0,0,0,0,0,0,0,0,0,0,0,0,0,0,0,0,0,0,0,0,0,0,0,0,0,0,0,{"$f":"AI234*AI130","v":0},0,0,0,0,0,0,0,0,0,0,0,0,0,0,0,0,0,0,0,0,0,0,0,0,0,0,0]
[null,"N26",{"$f":"IF(C133=\"\",0,VLOOKUP(C133,Düngemittel,5,FALSE))","v":0},0,0,0,0,0,0,0,0,0,0,0,0,0,0,0,0,0,0,0,0,0,0,0,0,0,0,0,0,0,0,0,{"$f":"IF(AI133=\"\",0,VLOOKUP(AI133,Düngemittel,5,FALSE))","v":0},0,0,0,0,0,0,0,0,0,0,0,0,0,0,0,0,0,0,0,0,0,0,0,0,0,0,0]
[1,null,{"$f":"C236*C135","v":0},0,0,0,0,0,0,0,0,0,0,0,0,0,0,0,0,0,0,0,0,0,0,0,0,0,0,0,0,0,0,0,{"$f":"AI236*AI135","v":0},0,0,0,0,0,0,0,0,0,0,0,0,0,0,0,0,0,0,0,0,0,0,0,0,0,0,0]
[null,"N27",{"$f":"IF(C138=\"\",0,VLOOKUP(C138,Düngemittel,5,FALSE))","v":0},0,0,0,0,0,0,0,0,0,0,0,0,0,0,0,0,0,0,0,0,0,0,0,0,0,0,0,0,0,0,0,{"$f":"IF(AI138=\"\",0,VLOOKUP(AI138,Düngemittel,5,FALSE))","v":0},0,0,0,0,0,0,0,0,0,0,0,0,0,0,0,0,0,0,0,0,0,0,0,0,0,0,0]
[1,null,{"$f":"C238*C140","v":0},0,0,0,0,0,0,0,0,0,0,0,0,0,0,0,0,0,0,0,0,0,0,0,0,0,0,0,0,0,0,0,{"$f":"AI238*AI140","v":0},0,0,0,0,0,0,0,0,0,0,0,0,0,0,0,0,0,0,0,0,0,0,0,0,0,0,0]
[null,"N28",{"$f":"IF(C143=\"\",0,VLOOKUP(C143,Düngemittel,5,FALSE))","v":0},0,0,0,0,0,0,0,0,0,0,0,0,0,0,0,0,0,0,0,0,0,0,0,0,0,0,0,0,0,0,0,{"$f":"IF(AI143=\"\",0,VLOOKUP(AI143,Düngemittel,5,FALSE))","v":0},0,0,0,0,0,0,0,0,0,0,0,0,0,0,0,0,0,0,0,0,0,0,0,0,0,0,0]
[1,null,{"$f":"C240*C145","v":0},0,0,0,0,0,0,0,0,0,0,0,0,0,0,0,0,0,0,0,0,0,0,0,0,0,0,0,0,0,0,0,{"$f":"AI240*AI145","v":0},0,0,0,0,0,0,0,0,0,0,0,0,0,0,0,0,0,0,0,0,0,0,0,0,0,0,0]
[null,"N29",{"$f":"IF(C148=\"\",0,VLOOKUP(C148,Düngemittel,5,FALSE))","v":0},0,0,0,0,0,0,0,0,0,0,0,0,0,0,0,0,0,0,0,0,0,0,0,0,0,0,0,0,0,0,0,{"$f":"IF(AI148=\"\",0,VLOOKUP(AI148,Düngemittel,5,FALSE))","v":0},0,0,0,0,0,0,0,0,0,0,0,0,0,0,0,0,0,0,0,0,0,0,0,0,0,0,0]
[1,null,{"$f":"C242*C150","v":0},0,0,0,0,0,0,0,0,0,0,0,0,0,0,0,0,0,0,0,0,0,0,0,0,0,0,0,0,0,0,0,{"$f":"AI242*AI150","v":0},0,0,0,0,0,0,0,0,0,0,0,0,0,0,0,0,0,0,0,0,0,0,0,0,0,0,0]
[null,"N30",{"$f":"IF(C153=\"\",0,VLOOKUP(C153,Düngemittel,5,FALSE))","v":0},0,0,0,0,0,0,0,0,0,0,0,0,0,0,0,0,0,0,0,0,0,0,0,0,0,0,0,0,0,0,0,{"$f":"IF(AI153=\"\",0,VLOOKUP(AI153,Düngemittel,5,FALSE))","v":0},0,0,0,0,0,0,0,0,0,0,0,0,0,0,0,0,0,0,0,0,0,0,0,0,0,0,0]
[1,null,{"$f":"C244*C155","v":0},0,0,0,0,0,0,0,0,0,0,0,0,0,0,0,0,0,0,0,0,0,0,0,0,0,0,0,0,0,0,0,{"$f":"AI244*AI155","v":0},0,0,0,0,0,0,0,0,0,0,0,0,0,0,0,0,0,0,0,0,0,0,0,0,0,0,0]
[null,"N31",{"$f":"IF(C158=\"\",0,VLOOKUP(C158,Düngemittel,5,FALSE))","v":0},0,0,0,0,0,0,0,0,0,0,0,0,0,0,0,0,0,0,0,0,0,0,0,0,0,0,0,0,0,0,0,{"$f":"IF(AI158=\"\",0,VLOOKUP(AI158,Düngemittel,5,FALSE))","v":0},0,0,0,0,0,0,0,0,0,0,0,0,0,0,0,0,0,0,0,0,0,0,0,0,0,0,0]
[1,null,{"$f":"C246*C160","v":0},0,0,0,0,0,0,0,0,0,0,0,0,0,0,0,0,0,0,0,0,0,0,0,0,0,0,0,0,0,0,0,{"$f":"AI246*AI160","v":0},0,0,0,0,0,0,0,0,0,0,0,0,0,0,0,0,0,0,0,0,0,0,0,0,0,0,0]
[null,"P1",{"$f":"IF(C8=\"\",0,VLOOKUP(C8,Düngemittel,7,FALSE))","v":0},0,0,0,0,0,0,0,0,0,0,0,0,0,0,0,0,0,0,0,0,0,0,0,0,0,0,0,0,0,0,0,{"$f":"IF(AI8=\"\",0,VLOOKUP(AI8,Düngemittel,7,FALSE))","v":0},0,0,0,0,0,0,0,0,0,0,0,0,0,0,0,0,0,0,0,0,0,0,0,0,0,0,0]
[1,null,{"$f":"C248*C10","v":0},0,0,0,0,0,0,0,0,0,0,0,0,0,0,0,0,0,0,0,0,0,0,0,0,0,0,0,0,0,0,0,{"$f":"AI248*AI10","v":0},0,0,0,0,0,0,0,0,0,0,0,0,0,0,0,0,0,0,0,0,0,0,0,0,0,0,0]
[null,"P2",{"$f":"IF(C13=\"\",0,VLOOKUP(C13,Düngemittel,7,FALSE))","v":0},0,0,0,0,0,0,0,0,0,0,0,0,0,0,0,0,0,0,0,0,0,0,0,0,0,0,0,0,0,0,0,{"$f":"IF(AI13=\"\",0,VLOOKUP(AI13,Düngemittel,7,FALSE))","v":0},0,0,0,0,0,0,0,0,0,0,0,0,0,0,0,0,0,0,0,0,0,0,0,0,0,0,0]
[1,null,{"$f":"C250*C15","v":0},0,0,0,0,0,0,0,0,0,0,0,0,0,0,0,0,0,0,0,0,0,0,0,0,0,0,0,0,0,0,0,{"$f":"AI250*AI15","v":0},0,0,0,0,0,0,0,0,0,0,0,0,0,0,0,0,0,0,0,0,0,0,0,0,0,0,0]
[null,"P3",{"$f":"IF(C18=\"\",0,VLOOKUP(C18,Düngemittel,7,FALSE))","v":0},0,0,0,0,0,0,0,0,0,0,0,0,0,0,0,0,0,0,0,0,0,0,0,0,0,0,0,0,0,0,0,{"$f":"IF(AI18=\"\",0,VLOOKUP(AI18,Düngemittel,7,FALSE))","v":0},0,0,0,0,0,0,0,0,0,0,0,0,0,0,0,0,0,0,0,0,0,0,0,0,0,0,0]
[1,null,{"$f":"C252*C20","v":0},0,0,0,0,0,0,0,0,0,0,0,0,0,0,0,0,0,0,0,0,0,0,0,0,0,0,0,0,0,0,0,{"$f":"AI252*AI20","v":0},0,0,0,0,0,0,0,0,0,0,0,0,0,0,0,0,0,0,0,0,0,0,0,0,0,0,0]
[null,"P4",{"$f":"IF(C23=\"\",0,VLOOKUP(C23,Düngemittel,7,FALSE))","v":0},0,0,0,0,0,0,0,0,0,0,0,0,0,0,0,0,0,0,0,0,0,0,0,0,0,0,0,0,0,0,0,{"$f":"IF(AI23=\"\",0,VLOOKUP(AI23,Düngemittel,7,FALSE))","v":0},0,0,0,0,0,0,0,0,0,0,0,0,0,0,0,0,0,0,0,0,0,0,0,0,0,0,0]
[1,null,{"$f":"C254*C25","v":0},0,0,0,0,0,0,0,0,0,0,0,0,0,0,0,0,0,0,0,0,0,0,0,0,0,0,0,0,0,0,0,{"$f":"AI254*AI25","v":0},0,0,0,0,0,0,0,0,0,0,0,0,0,0,0,0,0,0,0,0,0,0,0,0,0,0,0]
[null,"P5",{"$f":"IF(C28=\"\",0,VLOOKUP(C28,Düngemittel,7,FALSE))","v":0},0,0,0,0,0,0,0,0,0,0,0,0,0,0,0,0,0,0,0,0,0,0,0,0,0,0,0,0,0,0,0,{"$f":"IF(AI28=\"\",0,VLOOKUP(AI28,Düngemittel,7,FALSE))","v":0},0,0,0,0,0,0,0,0,0,0,0,0,0,0,0,0,0,0,0,0,0,0,0,0,0,0,0]
[1,null,{"$f":"C256*C30","v":0},0,0,0,0,0,0,0,0,0,0,0,0,0,0,0,0,0,0,0,0,0,0,0,0,0,0,0,0,0,0,0,{"$f":"AI256*AI30","v":0},0,0,0,0,0,0,0,0,0,0,0,0,0,0,0,0,0,0,0,0,0,0,0,0,0,0,0]
[null,"P6",{"$f":"IF(C33=\"\",0,VLOOKUP(C33,Düngemittel,7,FALSE))","v":0},0,0,0,0,0,0,0,0,0,0,0,0,0,0,0,0,0,0,0,0,0,0,0,0,0,0,0,0,0,0,0,{"$f":"IF(AI33=\"\",0,VLOOKUP(AI33,Düngemittel,7,FALSE))","v":0},0,0,0,0,0,0,0,0,0,0,0,0,0,0,0,0,0,0,0,0,0,0,0,0,0,0,0]
[1,null,{"$f":"C258*C35","v":0},0,0,0,0,0,0,0,0,0,0,0,0,0,0,0,0,0,0,0,0,0,0,0,0,0,0,0,0,0,0,0,{"$f":"AI258*AI35","v":0},0,0,0,0,0,0,0,0,0,0,0,0,0,0,0,0,0,0,0,0,0,0,0,0,0,0,0]
[null,"P7",{"$f":"IF(C38=\"\",0,VLOOKUP(C38,Düngemittel,7,FALSE))","v":0},0,0,0,0,0,0,0,0,0,0,0,0,0,0,0,0,0,0,0,0,0,0,0,0,0,0,0,0,0,0,0,{"$f":"IF(AI38=\"\",0,VLOOKUP(AI38,Düngemittel,7,FALSE))","v":0},0,0,0,0,0,0,0,0,0,0,0,0,0,0,0,0,0,0,0,0,0,0,0,0,0,0,0]
[1,null,{"$f":"C260*C40","v":0},0,0,0,0,0,0,0,0,0,0,0,0,0,0,0,0,0,0,0,0,0,0,0,0,0,0,0,0,0,0,0,{"$f":"AI260*AI40","v":0},0,0,0,0,0,0,0,0,0,0,0,0,0,0,0,0,0,0,0,0,0,0,0,0,0,0,0]
[null,"P8",{"$f":"IF(C43=\"\",0,VLOOKUP(C43,Düngemittel,7,FALSE))","v":0},0,0,0,0,0,0,0,0,0,0,0,0,0,0,0,0,0,0,0,0,0,0,0,0,0,0,0,0,0,0,0,{"$f":"IF(AI43=\"\",0,VLOOKUP(AI43,Düngemittel,7,FALSE))","v":0},0,0,0,0,0,0,0,0,0,0,0,0,0,0,0,0,0,0,0,0,0,0,0,0,0,0,0]
[1,null,{"$f":"C262*C45","v":0},0,0,0,0,0,0,0,0,0,0,0,0,0,0,0,0,0,0,0,0,0,0,0,0,0,0,0,0,0,0,0,{"$f":"AI262*AI45","v":0},0,0,0,0,0,0,0,0,0,0,0,0,0,0,0,0,0,0,0,0,0,0,0,0,0,0,0]
[null,"P9",{"$f":"IF(C48=\"\",0,VLOOKUP(C48,Düngemittel,7,FALSE))","v":0},0,0,0,0,0,0,0,0,0,0,0,0,0,0,0,0,0,0,0,0,0,0,0,0,0,0,0,0,0,0,0,{"$f":"IF(AI48=\"\",0,VLOOKUP(AI48,Düngemittel,7,FALSE))","v":0},0,0,0,0,0,0,0,0,0,0,0,0,0,0,0,0,0,0,0,0,0,0,0,0,0,0,0]
[1,null,{"$f":"C264*C50","v":0},0,0,0,0,0,0,0,0,0,0,0,0,0,0,0,0,0,0,0,0,0,0,0,0,0,0,0,0,0,0,0,{"$f":"AI264*AI50","v":0},0,0,0,0,0,0,0,0,0,0,0,0,0,0,0,0,0,0,0,0,0,0,0,0,0,0,0]
[null,"P10",{"$f":"IF(C53=\"\",0,VLOOKUP(C53,Düngemittel,7,FALSE))","v":0},0,0,0,0,0,0,0,0,0,0,0,0,0,0,0,0,0,0,0,0,0,0,0,0,0,0,0,0,0,0,0,{"$f":"IF(AI53=\"\",0,VLOOKUP(AI53,Düngemittel,7,FALSE))","v":0},0,0,0,0,0,0,0,0,0,0,0,0,0,0,0,0,0,0,0,0,0,0,0,0,0,0,0]
[1,null,{"$f":"C266*C55","v":0},0,0,0,0,0,0,0,0,0,0,0,0,0,0,0,0,0,0,0,0,0,0,0,0,0,0,0,0,0,0,0,{"$f":"AI266*AI55","v":0},0,0,0,0,0,0,0,0,0,0,0,0,0,0,0,0,0,0,0,0,0,0,0,0,0,0,0]
[null,"P11",{"$f":"IF(C58=\"\",0,VLOOKUP(C58,Düngemittel,7,FALSE))","v":0},0,0,0,0,0,0,0,0,0,0,0,0,0,0,0,0,0,0,0,0,0,0,0,0,0,0,0,0,0,0,0,{"$f":"IF(AI58=\"\",0,VLOOKUP(AI58,Düngemittel,7,FALSE))","v":0},0,0,0,0,0,0,0,0,0,0,0,0,0,0,0,0,0,0,0,0,0,0,0,0,0,0,0]
[1,null,{"$f":"C268*C60","v":0},0,0,0,0,0,0,0,0,0,0,0,0,0,0,0,0,0,0,0,0,0,0,0,0,0,0,0,0,0,0,0,{"$f":"AI268*AI60","v":0},0,0,0,0,0,0,0,0,0,0,0,0,0,0,0,0,0,0,0,0,0,0,0,0,0,0,0]
[null,"P12",{"$f":"IF(C63=\"\",0,VLOOKUP(C63,Düngemittel,7,FALSE))","v":0},0,0,0,0,0,0,0,0,0,0,0,0,0,0,0,0,0,0,0,0,0,0,0,0,0,0,0,0,0,0,0,{"$f":"IF(AI63=\"\",0,VLOOKUP(AI63,Düngemittel,7,FALSE))","v":0},0,0,0,0,0,0,0,0,0,0,0,0,0,0,0,0,0,0,0,0,0,0,0,0,0,0,0]
[1,null,{"$f":"C270*C65","v":0},0,0,0,0,0,0,0,0,0,0,0,0,0,0,0,0,0,0,0,0,0,0,0,0,0,0,0,0,0,0,0,{"$f":"AI270*AI65","v":0},0,0,0,0,0,0,0,0,0,0,0,0,0,0,0,0,0,0,0,0,0,0,0,0,0,0,0]
[null,"P13",{"$f":"IF(C68=\"\",0,VLOOKUP(C68,Düngemittel,7,FALSE))","v":0},0,0,0,0,0,0,0,0,0,0,0,0,0,0,0,0,0,0,0,0,0,0,0,0,0,0,0,0,0,0,0,{"$f":"IF(AI68=\"\",0,VLOOKUP(AI68,Düngemittel,7,FALSE))","v":0},0,0,0,0,0,0,0,0,0,0,0,0,0,0,0,0,0,0,0,0,0,0,0,0,0,0,0]
[1,null,{"$f":"C272*C70","v":0},0,0,0,0,0,0,0,0,0,0,0,0,0,0,0,0,0,0,0,0,0,0,0,0,0,0,0,0,0,0,0,{"$f":"AI272*AI70","v":0},0,0,0,0,0,0,0,0,0,0,0,0,0,0,0,0,0,0,0,0,0,0,0,0,0,0,0]
[null,"P14",{"$f":"IF(C73=\"\",0,VLOOKUP(C73,Düngemittel,7,FALSE))","v":0},0,0,0,0,0,0,0,0,0,0,0,0,0,0,0,0,0,0,0,0,0,0,0,0,0,0,0,0,0,0,0,{"$f":"IF(AI73=\"\",0,VLOOKUP(AI73,Düngemittel,7,FALSE))","v":0},0,0,0,0,0,0,0,0,0,0,0,0,0,0,0,0,0,0,0,0,0,0,0,0,0,0,0]
[1,null,{"$f":"C274*C75","v":0},0,0,0,0,0,0,0,0,0,0,0,0,0,0,0,0,0,0,0,0,0,0,0,0,0,0,0,0,0,0,0,{"$f":"AI274*AI75","v":0},0,0,0,0,0,0,0,0,0,0,0,0,0,0,0,0,0,0,0,0,0,0,0,0,0,0,0]
[null,"P15",{"$f":"IF(C78=\"\",0,VLOOKUP(C78,Düngemittel,7,FALSE))","v":0},0,0,0,0,0,0,0,0,0,0,0,0,0,0,0,0,0,0,0,0,0,0,0,0,0,0,0,0,0,0,0,{"$f":"IF(AI78=\"\",0,VLOOKUP(AI78,Düngemittel,7,FALSE))","v":0},0,0,0,0,0,0,0,0,0,0,0,0,0,0,0,0,0,0,0,0,0,0,0,0,0,0,0]
[1,null,{"$f":"C276*C80","v":0},0,0,0,0,0,0,0,0,0,0,0,0,0,0,0,0,0,0,0,0,0,0,0,0,0,0,0,0,0,0,0,{"$f":"AI276*AI80","v":0},0,0,0,0,0,0,0,0,0,0,0,0,0,0,0,0,0,0,0,0,0,0,0,0,0,0,0]
[null,"P16",{"$f":"IF(C83=\"\",0,VLOOKUP(C83,Düngemittel,7,FALSE))","v":0},0,0,0,0,0,0,0,0,0,0,0,0,0,0,0,0,0,0,0,0,0,0,0,0,0,0,0,0,0,0,0,{"$f":"IF(AI83=\"\",0,VLOOKUP(AI83,Düngemittel,7,FALSE))","v":0},0,0,0,0,0,0,0,0,0,0,0,0,0,0,0,0,0,0,0,0,0,0,0,0,0,0,0]
[1,null,{"$f":"C278*C85","v":0},0,0,0,0,0,0,0,0,0,0,0,0,0,0,0,0,0,0,0,0,0,0,0,0,0,0,0,0,0,0,0,{"$f":"AI278*AI85","v":0},0,0,0,0,0,0,0,0,0,0,0,0,0,0,0,0,0,0,0,0,0,0,0,0,0,0,0]
[null,"P17",{"$f":"IF(C88=\"\",0,VLOOKUP(C88,Düngemittel,7,FALSE))","v":0},0,0,0,0,0,0,0,0,0,0,0,0,0,0,0,0,0,0,0,0,0,0,0,0,0,0,0,0,0,0,0,{"$f":"IF(AI88=\"\",0,VLOOKUP(AI88,Düngemittel,7,FALSE))","v":0},0,0,0,0,0,0,0,0,0,0,0,0,0,0,0,0,0,0,0,0,0,0,0,0,0,0,0]
[1,null,{"$f":"C280*C90","v":0},0,0,0,0,0,0,0,0,0,0,0,0,0,0,0,0,0,0,0,0,0,0,0,0,0,0,0,0,0,0,0,{"$f":"AI280*AI90","v":0},0,0,0,0,0,0,0,0,0,0,0,0,0,0,0,0,0,0,0,0,0,0,0,0,0,0,0]
[null,"P18",{"$f":"IF(C93=\"\",0,VLOOKUP(C93,Düngemittel,7,FALSE))","v":0},0,0,0,0,0,0,0,0,0,0,0,0,0,0,0,0,0,0,0,0,0,0,0,0,0,0,0,0,0,0,0,{"$f":"IF(AI93=\"\",0,VLOOKUP(AI93,Düngemittel,7,FALSE))","v":0},0,0,0,0,0,0,0,0,0,0,0,0,0,0,0,0,0,0,0,0,0,0,0,0,0,0,0]
[1,null,{"$f":"C282*C95","v":0},0,0,0,0,0,0,0,0,0,0,0,0,0,0,0,0,0,0,0,0,0,0,0,0,0,0,0,0,0,0,0,{"$f":"AI282*AI95","v":0},0,0,0,0,0,0,0,0,0,0,0,0,0,0,0,0,0,0,0,0,0,0,0,0,0,0,0]
[null,"P19",{"$f":"IF(C98=\"\",0,VLOOKUP(C98,Düngemittel,7,FALSE))","v":0},0,0,0,0,0,0,0,0,0,0,0,0,0,0,0,0,0,0,0,0,0,0,0,0,0,0,0,0,0,0,0,{"$f":"IF(AI98=\"\",0,VLOOKUP(AI98,Düngemittel,7,FALSE))","v":0},0,0,0,0,0,0,0,0,0,0,0,0,0,0,0,0,0,0,0,0,0,0,0,0,0,0,0]
[1,null,{"$f":"C284*C100","v":0},0,0,0,0,0,0,0,0,0,0,0,0,0,0,0,0,0,0,0,0,0,0,0,0,0,0,0,0,0,0,0,{"$f":"AI284*AI100","v":0},0,0,0,0,0,0,0,0,0,0,0,0,0,0,0,0,0,0,0,0,0,0,0,0,0,0,0]
[null,"P20",{"$f":"IF(C103=\"\",0,VLOOKUP(C103,Düngemittel,7,FALSE))","v":0},0,0,0,0,0,0,0,0,0,0,0,0,0,0,0,0,0,0,0,0,0,0,0,0,0,0,0,0,0,0,0,{"$f":"IF(AI103=\"\",0,VLOOKUP(AI103,Düngemittel,7,FALSE))","v":0},0,0,0,0,0,0,0,0,0,0,0,0,0,0,0,0,0,0,0,0,0,0,0,0,0,0,0]
[1,null,{"$f":"C286*C105","v":0},0,0,0,0,0,0,0,0,0,0,0,0,0,0,0,0,0,0,0,0,0,0,0,0,0,0,0,0,0,0,0,{"$f":"AI286*AI105","v":0},0,0,0,0,0,0,0,0,0,0,0,0,0,0,0,0,0,0,0,0,0,0,0,0,0,0,0]
[null,"P21",{"$f":"IF(C108=\"\",0,VLOOKUP(C108,Düngemittel,7,FALSE))","v":0},0,0,0,0,0,0,0,0,0,0,0,0,0,0,0,0,0,0,0,0,0,0,0,0,0,0,0,0,0,0,0,{"$f":"IF(AI108=\"\",0,VLOOKUP(AI108,Düngemittel,7,FALSE))","v":0},0,0,0,0,0,0,0,0,0,0,0,0,0,0,0,0,0,0,0,0,0,0,0,0,0,0,0]
[1,null,{"$f":"C288*C110","v":0},0,0,0,0,0,0,0,0,0,0,0,0,0,0,0,0,0,0,0,0,0,0,0,0,0,0,0,0,0,0,0,{"$f":"AI288*AI110","v":0},0,0,0,0,0,0,0,0,0,0,0,0,0,0,0,0,0,0,0,0,0,0,0,0,0,0,0]
[null,"P22",{"$f":"IF(C113=\"\",0,VLOOKUP(C113,Düngemittel,7,FALSE))","v":0},0,0,0,0,0,0,0,0,0,0,0,0,0,0,0,0,0,0,0,0,0,0,0,0,0,0,0,0,0,0,0,{"$f":"IF(AI113=\"\",0,VLOOKUP(AI113,Düngemittel,7,FALSE))","v":0},0,0,0,0,0,0,0,0,0,0,0,0,0,0,0,0,0,0,0,0,0,0,0,0,0,0,0]
[1,null,{"$f":"C290*C115","v":0},0,0,0,0,0,0,0,0,0,0,0,0,0,0,0,0,0,0,0,0,0,0,0,0,0,0,0,0,0,0,0,{"$f":"AI290*AI115","v":0},0,0,0,0,0,0,0,0,0,0,0,0,0,0,0,0,0,0,0,0,0,0,0,0,0,0,0]
[null,"P23",{"$f":"IF(C118=\"\",0,VLOOKUP(C118,Düngemittel,7,FALSE))","v":0},0,0,0,0,0,0,0,0,0,0,0,0,0,0,0,0,0,0,0,0,0,0,0,0,0,0,0,0,0,0,0,{"$f":"IF(AI118=\"\",0,VLOOKUP(AI118,Düngemittel,7,FALSE))","v":0},0,0,0,0,0,0,0,0,0,0,0,0,0,0,0,0,0,0,0,0,0,0,0,0,0,0,0]
[1,null,{"$f":"C292*C120","v":0},0,0,0,0,0,0,0,0,0,0,0,0,0,0,0,0,0,0,0,0,0,0,0,0,0,0,0,0,0,0,0,{"$f":"AI292*AI120","v":0},0,0,0,0,0,0,0,0,0,0,0,0,0,0,0,0,0,0,0,0,0,0,0,0,0,0,0]
[null,"P24",{"$f":"IF(C123=\"\",0,VLOOKUP(C123,Düngemittel,7,FALSE))","v":0},0,0,0,0,0,0,0,0,0,0,0,0,0,0,0,0,0,0,0,0,0,0,0,0,0,0,0,0,0,0,0,{"$f":"IF(AI123=\"\",0,VLOOKUP(AI123,Düngemittel,7,FALSE))","v":0},0,0,0,0,0,0,0,0,0,0,0,0,0,0,0,0,0,0,0,0,0,0,0,0,0,0,0]
[1,null,{"$f":"C294*C125","v":0},0,0,0,0,0,0,0,0,0,0,0,0,0,0,0,0,0,0,0,0,0,0,0,0,0,0,0,0,0,0,0,{"$f":"AI294*AI125","v":0},0,0,0,0,0,0,0,0,0,0,0,0,0,0,0,0,0,0,0,0,0,0,0,0,0,0,0]
[null,"P25",{"$f":"IF(C128=\"\",0,VLOOKUP(C128,Düngemittel,7,FALSE))","v":0},0,0,0,0,0,0,0,0,0,0,0,0,0,0,0,0,0,0,0,0,0,0,0,0,0,0,0,0,0,0,0,{"$f":"IF(AI128=\"\",0,VLOOKUP(AI128,Düngemittel,7,FALSE))","v":0},0,0,0,0,0,0,0,0,0,0,0,0,0,0,0,0,0,0,0,0,0,0,0,0,0,0,0]
[1,null,{"$f":"C296*C130","v":0},0,0,0,0,0,0,0,0,0,0,0,0,0,0,0,0,0,0,0,0,0,0,0,0,0,0,0,0,0,0,0,{"$f":"AI296*AI130","v":0},0,0,0,0,0,0,0,0,0,0,0,0,0,0,0,0,0,0,0,0,0,0,0,0,0,0,0]
[null,"P26",{"$f":"IF(C133=\"\",0,VLOOKUP(C133,Düngemittel,7,FALSE))","v":0},0,0,0,0,0,0,0,0,0,0,0,0,0,0,0,0,0,0,0,0,0,0,0,0,0,0,0,0,0,0,0,{"$f":"IF(AI133=\"\",0,VLOOKUP(AI133,Düngemittel,7,FALSE))","v":0},0,0,0,0,0,0,0,0,0,0,0,0,0,0,0,0,0,0,0,0,0,0,0,0,0,0,0]
[1,null,{"$f":"C298*C135","v":0},0,0,0,0,0,0,0,0,0,0,0,0,0,0,0,0,0,0,0,0,0,0,0,0,0,0,0,0,0,0,0,{"$f":"AI298*AI135","v":0},0,0,0,0,0,0,0,0,0,0,0,0,0,0,0,0,0,0,0,0,0,0,0,0,0,0,0]
[null,"P27",{"$f":"IF(C138=\"\",0,VLOOKUP(C138,Düngemittel,7,FALSE))","v":0},0,0,0,0,0,0,0,0,0,0,0,0,0,0,0,0,0,0,0,0,0,0,0,0,0,0,0,0,0,0,0,{"$f":"IF(AI138=\"\",0,VLOOKUP(AI138,Düngemittel,7,FALSE))","v":0},0,0,0,0,0,0,0,0,0,0,0,0,0,0,0,0,0,0,0,0,0,0,0,0,0,0,0]
[1,null,{"$f":"C300*C140","v":0},0,0,0,0,0,0,0,0,0,0,0,0,0,0,0,0,0,0,0,0,0,0,0,0,0,0,0,0,0,0,0,{"$f":"AI300*AI140","v":0},0,0,0,0,0,0,0,0,0,0,0,0,0,0,0,0,0,0,0,0,0,0,0,0,0,0,0]
[null,"P28",{"$f":"IF(C143=\"\",0,VLOOKUP(C143,Düngemittel,7,FALSE))","v":0},0,0,0,0,0,0,0,0,0,0,0,0,0,0,0,0,0,0,0,0,0,0,0,0,0,0,0,0,0,0,0,{"$f":"IF(AI143=\"\",0,VLOOKUP(AI143,Düngemittel,7,FALSE))","v":0},0,0,0,0,0,0,0,0,0,0,0,0,0,0,0,0,0,0,0,0,0,0,0,0,0,0,0]
[1,null,{"$f":"C302*C145","v":0},0,0,0,0,0,0,0,0,0,0,0,0,0,0,0,0,0,0,0,0,0,0,0,0,0,0,0,0,0,0,0,{"$f":"AI302*AI145","v":0},0,0,0,0,0,0,0,0,0,0,0,0,0,0,0,0,0,0,0,0,0,0,0,0,0,0,0]
[null,"P29",{"$f":"IF(C148=\"\",0,VLOOKUP(C148,Düngemittel,7,FALSE))","v":0},0,0,0,0,0,0,0,0,0,0,0,0,0,0,0,0,0,0,0,0,0,0,0,0,0,0,0,0,0,0,0,{"$f":"IF(AI148=\"\",0,VLOOKUP(AI148,Düngemittel,7,FALSE))","v":0},0,0,0,0,0,0,0,0,0,0,0,0,0,0,0,0,0,0,0,0,0,0,0,0,0,0,0]
[1,null,{"$f":"C304*C150","v":0},0,0,0,0,0,0,0,0,0,0,0,0,0,0,0,0,0,0,0,0,0,0,0,0,0,0,0,0,0,0,0,{"$f":"AI304*AI150","v":0},0,0,0,0,0,0,0,0,0,0,0,0,0,0,0,0,0,0,0,0,0,0,0,0,0,0,0]
[null,"P30",{"$f":"IF(C153=\"\",0,VLOOKUP(C153,Düngemittel,7,FALSE))","v":0},0,0,0,0,0,0,0,0,0,0,0,0,0,0,0,0,0,0,0,0,0,0,0,0,0,0,0,0,0,0,0,{"$f":"IF(AI153=\"\",0,VLOOKUP(AI153,Düngemittel,7,FALSE))","v":0},0,0,0,0,0,0,0,0,0,0,0,0,0,0,0,0,0,0,0,0,0,0,0,0,0,0,0]
[1,null,{"$f":"C306*C155","v":0},0,0,0,0,0,0,0,0,0,0,0,0,0,0,0,0,0,0,0,0,0,0,0,0,0,0,0,0,0,0,0,{"$f":"AI306*AI155","v":0},0,0,0,0,0,0,0,0,0,0,0,0,0,0,0,0,0,0,0,0,0,0,0,0,0,0,0]
[null,"P31",{"$f":"IF(C158=\"\",0,VLOOKUP(C158,Düngemittel,7,FALSE))","v":0},0,0,0,0,0,0,0,0,0,0,0,0,0,0,0,0,0,0,0,0,0,0,0,0,0,0,0,0,0,0,0,{"$f":"IF(AI158=\"\",0,VLOOKUP(AI158,Düngemittel,7,FALSE))","v":0},0,0,0,0,0,0,0,0,0,0,0,0,0,0,0,0,0,0,0,0,0,0,0,0,0,0,0]
[1,null,{"$f":"C308*C160","v":0},0,0,0,0,0,0,0,0,0,0,0,0,0,0,0,0,0,0,0,0,0,0,0,0,0,0,0,0,0,0,0,{"$f":"AI308*AI160","v":0},0,0,0,0,0,0,0,0,0,0,0,0,0,0,0,0,0,0,0,0,0,0,0,0,0,0,0]
[null,"K1",{"$f":"IF(C8=\"\",0,VLOOKUP(C8,Düngemittel,9,FALSE))","v":0},0,0,0,0,0,0,0,0,0,0,0,0,0,0,0,0,0,0,0,0,0,0,0,0,0,0,0,0,0,0,0,{"$f":"IF(AI8=\"\",0,VLOOKUP(AI8,Düngemittel,9,FALSE))","v":0},0,0,0,0,0,0,0,0,0,0,0,0,0,0,0,0,0,0,0,0,0,0,0,0,0,0,0]
[1,null,{"$f":"C310*C10","v":0},0,0,0,0,0,0,0,0,0,0,0,0,0,0,0,0,0,0,0,0,0,0,0,0,0,0,0,0,0,0,0,{"$f":"AI310*AI10","v":0},0,0,0,0,0,0,0,0,0,0,0,0,0,0,0,0,0,0,0,0,0,0,0,0,0,0,0]
[null,"K2",{"$f":"IF(C13=\"\",0,VLOOKUP(C13,Düngemittel,9,FALSE))","v":40},0,0,0,0,0,0,0,0,0,0,0,0,0,0,0,0,0,0,0,0,0,0,0,0,0,0,0,0,0,0,0,{"$f":"IF(AI13=\"\",0,VLOOKUP(AI13,Düngemittel,9,FALSE))","v":0},0,0,0,0,0,0,0,0,0,0,0,0,0,0,0,0,0,0,0,0,0,0,0,0,0,0,0]
[1,null,{"$f":"C312*C15","v":100},0,0,0,0,0,0,0,0,0,0,0,0,0,0,0,0,0,0,0,0,0,0,0,0,0,0,0,0,0,0,0,{"$f":"AI312*AI15","v":0},0,0,0,0,0,0,0,0,0,0,0,0,0,0,0,0,0,0,0,0,0,0,0,0,0,0,0]
[null,"K3",{"$f":"IF(C18=\"\",0,VLOOKUP(C18,Düngemittel,9,FALSE))","v":0},0,0,0,0,0,0,0,0,0,0,0,0,0,0,0,0,0,0,0,0,0,0,0,0,0,0,0,0,0,0,0,{"$f":"IF(AI18=\"\",0,VLOOKUP(AI18,Düngemittel,9,FALSE))","v":0},0,0,0,0,0,0,0,0,0,0,0,0,0,0,0,0,0,0,0,0,0,0,0,0,0,0,0]
[1,null,{"$f":"C314*C20","v":0},0,0,0,0,0,0,0,0,0,0,0,0,0,0,0,0,0,0,0,0,0,0,0,0,0,0,0,0,0,0,0,{"$f":"AI314*AI20","v":0},0,0,0,0,0,0,0,0,0,0,0,0,0,0,0,0,0,0,0,0,0,0,0,0,0,0,0]
[null,"K4",{"$f":"IF(C23=\"\",0,VLOOKUP(C23,Düngemittel,9,FALSE))","v":0},0,0,0,0,0,0,0,0,0,0,0,0,0,0,0,0,0,0,0,0,0,0,0,0,0,0,0,0,0,0,0,{"$f":"IF(AI23=\"\",0,VLOOKUP(AI23,Düngemittel,9,FALSE))","v":0},0,0,0,0,0,0,0,0,0,0,0,0,0,0,0,0,0,0,0,0,0,0,0,0,0,0,0]
[1,null,{"$f":"C316*C25","v":0},0,0,0,0,0,0,0,0,0,0,0,0,0,0,0,0,0,0,0,0,0,0,0,0,0,0,0,0,0,0,0,{"$f":"AI316*AI25","v":0},0,0,0,0,0,0,0,0,0,0,0,0,0,0,0,0,0,0,0,0,0,0,0,0,0,0,0]
[null,"K5",{"$f":"IF(C28=\"\",0,VLOOKUP(C28,Düngemittel,9,FALSE))","v":0},0,0,0,0,0,0,0,0,0,0,0,0,0,0,0,0,0,0,0,0,0,0,0,0,0,0,0,0,0,0,0,{"$f":"IF(AI28=\"\",0,VLOOKUP(AI28,Düngemittel,9,FALSE))","v":0},0,0,0,0,0,0,0,0,0,0,0,0,0,0,0,0,0,0,0,0,0,0,0,0,0,0,0]
[1,null,{"$f":"C318*C30","v":0},0,0,0,0,0,0,0,0,0,0,0,0,0,0,0,0,0,0,0,0,0,0,0,0,0,0,0,0,0,0,0,{"$f":"AI318*AI30","v":0},0,0,0,0,0,0,0,0,0,0,0,0,0,0,0,0,0,0,0,0,0,0,0,0,0,0,0]
[null,"K6",{"$f":"IF(C33=\"\",0,VLOOKUP(C33,Düngemittel,9,FALSE))","v":0},0,0,0,0,0,0,0,0,0,0,0,0,0,0,0,0,0,0,0,0,0,0,0,0,0,0,0,0,0,0,0,{"$f":"IF(AI33=\"\",0,VLOOKUP(AI33,Düngemittel,9,FALSE))","v":0},0,0,0,0,0,0,0,0,0,0,0,0,0,0,0,0,0,0,0,0,0,0,0,0,0,0,0]
[1,null,{"$f":"C320*C35","v":0},0,0,0,0,0,0,0,0,0,0,0,0,0,0,0,0,0,0,0,0,0,0,0,0,0,0,0,0,0,0,0,{"$f":"AI320*AI35","v":0},0,0,0,0,0,0,0,0,0,0,0,0,0,0,0,0,0,0,0,0,0,0,0,0,0,0,0]
[null,"K7",{"$f":"IF(C38=\"\",0,VLOOKUP(C38,Düngemittel,9,FALSE))","v":0},0,0,0,0,0,0,0,0,0,0,0,0,0,0,0,0,0,0,0,0,0,0,0,0,0,0,0,0,0,0,0,{"$f":"IF(AI38=\"\",0,VLOOKUP(AI38,Düngemittel,9,FALSE))","v":0},0,0,0,0,0,0,0,0,0,0,0,0,0,0,0,0,0,0,0,0,0,0,0,0,0,0,0]
[1,null,{"$f":"C322*C40","v":0},0,0,0,0,0,0,0,0,0,0,0,0,0,0,0,0,0,0,0,0,0,0,0,0,0,0,0,0,0,0,0,{"$f":"AI322*AI40","v":0},0,0,0,0,0,0,0,0,0,0,0,0,0,0,0,0,0,0,0,0,0,0,0,0,0,0,0]
[null,"K8",{"$f":"IF(C43=\"\",0,VLOOKUP(C43,Düngemittel,9,FALSE))","v":0},0,0,0,0,0,0,0,0,0,0,0,0,0,0,0,0,0,0,0,0,0,0,0,0,0,0,0,0,0,0,0,{"$f":"IF(AI43=\"\",0,VLOOKUP(AI43,Düngemittel,9,FALSE))","v":0},0,0,0,0,0,0,0,0,0,0,0,0,0,0,0,0,0,0,0,0,0,0,0,0,0,0,0]
[1,null,{"$f":"C324*C45","v":0},0,0,0,0,0,0,0,0,0,0,0,0,0,0,0,0,0,0,0,0,0,0,0,0,0,0,0,0,0,0,0,{"$f":"AI324*AI45","v":0},0,0,0,0,0,0,0,0,0,0,0,0,0,0,0,0,0,0,0,0,0,0,0,0,0,0,0]
[null,"K9",{"$f":"IF(C48=\"\",0,VLOOKUP(C48,Düngemittel,9,FALSE))","v":0},0,0,0,0,0,0,0,0,0,0,0,0,0,0,0,0,0,0,0,0,0,0,0,0,0,0,0,0,0,0,0,{"$f":"IF(AI48=\"\",0,VLOOKUP(AI48,Düngemittel,9,FALSE))","v":0},0,0,0,0,0,0,0,0,0,0,0,0,0,0,0,0,0,0,0,0,0,0,0,0,0,0,0]
[1,null,{"$f":"C326*C50","v":0},0,0,0,0,0,0,0,0,0,0,0,0,0,0,0,0,0,0,0,0,0,0,0,0,0,0,0,0,0,0,0,{"$f":"AI326*AI50","v":0},0,0,0,0,0,0,0,0,0,0,0,0,0,0,0,0,0,0,0,0,0,0,0,0,0,0,0]
[null,"K10",{"$f":"IF(C53=\"\",0,VLOOKUP(C53,Düngemittel,9,FALSE))","v":0},0,0,0,0,0,0,0,0,0,0,0,0,0,0,0,0,0,0,0,0,0,0,0,0,0,0,0,0,0,0,0,{"$f":"IF(AI53=\"\",0,VLOOKUP(AI53,Düngemittel,9,FALSE))","v":0},0,0,0,0,0,0,0,0,0,0,0,0,0,0,0,0,0,0,0,0,0,0,0,0,0,0,0]
[1,null,{"$f":"C328*C55","v":0},0,0,0,0,0,0,0,0,0,0,0,0,0,0,0,0,0,0,0,0,0,0,0,0,0,0,0,0,0,0,0,{"$f":"AI328*AI55","v":0},0,0,0,0,0,0,0,0,0,0,0,0,0,0,0,0,0,0,0,0,0,0,0,0,0,0,0]
[null,"K11",{"$f":"IF(C58=\"\",0,VLOOKUP(C58,Düngemittel,9,FALSE))","v":0},0,0,0,0,0,0,0,0,0,0,0,0,0,0,0,0,0,0,0,0,0,0,0,0,0,0,0,0,0,0,0,{"$f":"IF(AI58=\"\",0,VLOOKUP(AI58,Düngemittel,9,FALSE))","v":0},0,0,0,0,0,0,0,0,0,0,0,0,0,0,0,0,0,0,0,0,0,0,0,0,0,0,0]
[1,null,{"$f":"C330*C60","v":0},0,0,0,0,0,0,0,0,0,0,0,0,0,0,0,0,0,0,0,0,0,0,0,0,0,0,0,0,0,0,0,{"$f":"AI330*AI60","v":0},0,0,0,0,0,0,0,0,0,0,0,0,0,0,0,0,0,0,0,0,0,0,0,0,0,0,0]
[null,"K12",{"$f":"IF(C63=\"\",0,VLOOKUP(C63,Düngemittel,9,FALSE))","v":0},0,0,0,0,0,0,0,0,0,0,0,0,0,0,0,0,0,0,0,0,0,0,0,0,0,0,0,0,0,0,0,{"$f":"IF(AI63=\"\",0,VLOOKUP(AI63,Düngemittel,9,FALSE))","v":0},0,0,0,0,0,0,0,0,0,0,0,0,0,0,0,0,0,0,0,0,0,0,0,0,0,0,0]
[1,null,{"$f":"C332*C65","v":0},0,0,0,0,0,0,0,0,0,0,0,0,0,0,0,0,0,0,0,0,0,0,0,0,0,0,0,0,0,0,0,{"$f":"AI332*AI65","v":0},0,0,0,0,0,0,0,0,0,0,0,0,0,0,0,0,0,0,0,0,0,0,0,0,0,0,0]
[null,"K13",{"$f":"IF(C68=\"\",0,VLOOKUP(C68,Düngemittel,9,FALSE))","v":0},0,0,0,0,0,0,0,0,0,0,0,0,0,0,0,0,0,0,0,0,0,0,0,0,0,0,0,0,0,0,0,{"$f":"IF(AI68=\"\",0,VLOOKUP(AI68,Düngemittel,9,FALSE))","v":0},0,0,0,0,0,0,0,0,0,0,0,0,0,0,0,0,0,0,0,0,0,0,0,0,0,0,0]
[1,null,{"$f":"C334*C70","v":0},0,0,0,0,0,0,0,0,0,0,0,0,0,0,0,0,0,0,0,0,0,0,0,0,0,0,0,0,0,0,0,{"$f":"AI334*AI70","v":0},0,0,0,0,0,0,0,0,0,0,0,0,0,0,0,0,0,0,0,0,0,0,0,0,0,0,0]
[null,"K14",{"$f":"IF(C73=\"\",0,VLOOKUP(C73,Düngemittel,9,FALSE))","v":0},0,0,0,0,0,0,0,0,0,0,0,0,0,0,0,0,0,0,0,0,0,0,0,0,0,0,0,0,0,0,0,{"$f":"IF(AI73=\"\",0,VLOOKUP(AI73,Düngemittel,9,FALSE))","v":0},0,0,0,0,0,0,0,0,0,0,0,0,0,0,0,0,0,0,0,0,0,0,0,0,0,0,0]
[1,null,{"$f":"C336*C75","v":0},0,0,0,0,0,0,0,0,0,0,0,0,0,0,0,0,0,0,0,0,0,0,0,0,0,0,0,0,0,0,0,{"$f":"AI336*AI75","v":0},0,0,0,0,0,0,0,0,0,0,0,0,0,0,0,0,0,0,0,0,0,0,0,0,0,0,0]
[null,"K15",{"$f":"IF(C78=\"\",0,VLOOKUP(C78,Düngemittel,9,FALSE))","v":0},0,0,0,0,0,0,0,0,0,0,0,0,0,0,0,0,0,0,0,0,0,0,0,0,0,0,0,0,0,0,0,{"$f":"IF(AI78=\"\",0,VLOOKUP(AI78,Düngemittel,9,FALSE))","v":0},0,0,0,0,0,0,0,0,0,0,0,0,0,0,0,0,0,0,0,0,0,0,0,0,0,0,0]
[1,null,{"$f":"C338*C80","v":0},0,0,0,0,0,0,0,0,0,0,0,0,0,0,0,0,0,0,0,0,0,0,0,0,0,0,0,0,0,0,0,{"$f":"AI338*AI80","v":0},0,0,0,0,0,0,0,0,0,0,0,0,0,0,0,0,0,0,0,0,0,0,0,0,0,0,0]
[null,"K16",{"$f":"IF(C83=\"\",0,VLOOKUP(C83,Düngemittel,9,FALSE))","v":0},0,0,0,0,0,0,0,0,0,0,0,0,0,0,0,0,0,0,0,0,0,0,0,0,0,0,0,0,0,0,0,{"$f":"IF(AI83=\"\",0,VLOOKUP(AI83,Düngemittel,9,FALSE))","v":0},0,0,0,0,0,0,0,0,0,0,0,0,0,0,0,0,0,0,0,0,0,0,0,0,0,0,0]
[1,null,{"$f":"C340*C85","v":0},0,0,0,0,0,0,0,0,0,0,0,0,0,0,0,0,0,0,0,0,0,0,0,0,0,0,0,0,0,0,0,{"$f":"AI340*AI85","v":0},0,0,0,0,0,0,0,0,0,0,0,0,0,0,0,0,0,0,0,0,0,0,0,0,0,0,0]
[null,"K17",{"$f":"IF(C88=\"\",0,VLOOKUP(C88,Düngemittel,9,FALSE))","v":0},0,0,0,0,0,0,0,0,0,0,0,0,0,0,0,0,0,0,0,0,0,0,0,0,0,0,0,0,0,0,0,{"$f":"IF(AI88=\"\",0,VLOOKUP(AI88,Düngemittel,9,FALSE))","v":0},0,0,0,0,0,0,0,0,0,0,0,0,0,0,0,0,0,0,0,0,0,0,0,0,0,0,0]
[1,null,{"$f":"C342*C90","v":0},0,0,0,0,0,0,0,0,0,0,0,0,0,0,0,0,0,0,0,0,0,0,0,0,0,0,0,0,0,0,0,{"$f":"AI342*AI90","v":0},0,0,0,0,0,0,0,0,0,0,0,0,0,0,0,0,0,0,0,0,0,0,0,0,0,0,0]
[null,"K18",{"$f":"IF(C93=\"\",0,VLOOKUP(C93,Düngemittel,9,FALSE))","v":0},0,0,0,0,0,0,0,0,0,0,0,0,0,0,0,0,0,0,0,0,0,0,0,0,0,0,0,0,0,0,0,{"$f":"IF(AI93=\"\",0,VLOOKUP(AI93,Düngemittel,9,FALSE))","v":0},0,0,0,0,0,0,0,0,0,0,0,0,0,0,0,0,0,0,0,0,0,0,0,0,0,0,0]
[1,null,{"$f":"C344*C95","v":0},0,0,0,0,0,0,0,0,0,0,0,0,0,0,0,0,0,0,0,0,0,0,0,0,0,0,0,0,0,0,0,{"$f":"AI344*AI95","v":0},0,0,0,0,0,0,0,0,0,0,0,0,0,0,0,0,0,0,0,0,0,0,0,0,0,0,0]
[null,"K19",{"$f":"IF(C98=\"\",0,VLOOKUP(C98,Düngemittel,9,FALSE))","v":0},0,0,0,0,0,0,0,0,0,0,0,0,0,0,0,0,0,0,0,0,0,0,0,0,0,0,0,0,0,0,0,{"$f":"IF(AI98=\"\",0,VLOOKUP(AI98,Düngemittel,9,FALSE))","v":0},0,0,0,0,0,0,0,0,0,0,0,0,0,0,0,0,0,0,0,0,0,0,0,0,0,0,0]
[1,null,{"$f":"C346*C100","v":0},0,0,0,0,0,0,0,0,0,0,0,0,0,0,0,0,0,0,0,0,0,0,0,0,0,0,0,0,0,0,0,{"$f":"AI346*AI100","v":0},0,0,0,0,0,0,0,0,0,0,0,0,0,0,0,0,0,0,0,0,0,0,0,0,0,0,0]
[null,"K20",{"$f":"IF(C103=\"\",0,VLOOKUP(C103,Düngemittel,9,FALSE))","v":0},0,0,0,0,0,0,0,0,0,0,0,0,0,0,0,0,0,0,0,0,0,0,0,0,0,0,0,0,0,0,0,{"$f":"IF(AI103=\"\",0,VLOOKUP(AI103,Düngemittel,9,FALSE))","v":0},0,0,0,0,0,0,0,0,0,0,0,0,0,0,0,0,0,0,0,0,0,0,0,0,0,0,0]
[1,null,{"$f":"C348*C105","v":0},0,0,0,0,0,0,0,0,0,0,0,0,0,0,0,0,0,0,0,0,0,0,0,0,0,0,0,0,0,0,0,{"$f":"AI348*AI105","v":0},0,0,0,0,0,0,0,0,0,0,0,0,0,0,0,0,0,0,0,0,0,0,0,0,0,0,0]
[null,"K21",{"$f":"IF(C108=\"\",0,VLOOKUP(C108,Düngemittel,9,FALSE))","v":0},0,0,0,0,0,0,0,0,0,0,0,0,0,0,0,0,0,0,0,0,0,0,0,0,0,0,0,0,0,0,0,{"$f":"IF(AI108=\"\",0,VLOOKUP(AI108,Düngemittel,9,FALSE))","v":0},0,0,0,0,0,0,0,0,0,0,0,0,0,0,0,0,0,0,0,0,0,0,0,0,0,0,0]
[1,null,{"$f":"C350*C110","v":0},0,0,0,0,0,0,0,0,0,0,0,0,0,0,0,0,0,0,0,0,0,0,0,0,0,0,0,0,0,0,0,{"$f":"AI350*AI110","v":0},0,0,0,0,0,0,0,0,0,0,0,0,0,0,0,0,0,0,0,0,0,0,0,0,0,0,0]
[null,"K22",{"$f":"IF(C113=\"\",0,VLOOKUP(C113,Düngemittel,9,FALSE))","v":0},0,0,0,0,0,0,0,0,0,0,0,0,0,0,0,0,0,0,0,0,0,0,0,0,0,0,0,0,0,0,0,{"$f":"IF(AI113=\"\",0,VLOOKUP(AI113,Düngemittel,9,FALSE))","v":0},0,0,0,0,0,0,0,0,0,0,0,0,0,0,0,0,0,0,0,0,0,0,0,0,0,0,0]
[1,null,{"$f":"C352*C115","v":0},0,0,0,0,0,0,0,0,0,0,0,0,0,0,0,0,0,0,0,0,0,0,0,0,0,0,0,0,0,0,0,{"$f":"AI352*AI115","v":0},0,0,0,0,0,0,0,0,0,0,0,0,0,0,0,0,0,0,0,0,0,0,0,0,0,0,0]
[null,"K23",{"$f":"IF(C118=\"\",0,VLOOKUP(C118,Düngemittel,9,FALSE))","v":0},0,0,0,0,0,0,0,0,0,0,0,0,0,0,0,0,0,0,0,0,0,0,0,0,0,0,0,0,0,0,0,{"$f":"IF(AI118=\"\",0,VLOOKUP(AI118,Düngemittel,9,FALSE))","v":0},0,0,0,0,0,0,0,0,0,0,0,0,0,0,0,0,0,0,0,0,0,0,0,0,0,0,0]
[1,null,{"$f":"C354*C120","v":0},0,0,0,0,0,0,0,0,0,0,0,0,0,0,0,0,0,0,0,0,0,0,0,0,0,0,0,0,0,0,0,{"$f":"AI354*AI120","v":0},0,0,0,0,0,0,0,0,0,0,0,0,0,0,0,0,0,0,0,0,0,0,0,0,0,0,0]
[null,"K24",{"$f":"IF(C123=\"\",0,VLOOKUP(C123,Düngemittel,9,FALSE))","v":0},0,0,0,0,0,0,0,0,0,0,0,0,0,0,0,0,0,0,0,0,0,0,0,0,0,0,0,0,0,0,0,{"$f":"IF(AI123=\"\",0,VLOOKUP(AI123,Düngemittel,9,FALSE))","v":0},0,0,0,0,0,0,0,0,0,0,0,0,0,0,0,0,0,0,0,0,0,0,0,0,0,0,0]
[1,null,{"$f":"C356*C125","v":0},0,0,0,0,0,0,0,0,0,0,0,0,0,0,0,0,0,0,0,0,0,0,0,0,0,0,0,0,0,0,0,{"$f":"AI356*AI125","v":0},0,0,0,0,0,0,0,0,0,0,0,0,0,0,0,0,0,0,0,0,0,0,0,0,0,0,0]
[null,"K25",{"$f":"IF(C128=\"\",0,VLOOKUP(C128,Düngemittel,9,FALSE))","v":0},0,0,0,0,0,0,0,0,0,0,0,0,0,0,0,0,0,0,0,0,0,0,0,0,0,0,0,0,0,0,0,{"$f":"IF(AI128=\"\",0,VLOOKUP(AI128,Düngemittel,9,FALSE))","v":0},0,0,0,0,0,0,0,0,0,0,0,0,0,0,0,0,0,0,0,0,0,0,0,0,0,0,0]
[1,null,{"$f":"C358*C130","v":0},0,0,0,0,0,0,0,0,0,0,0,0,0,0,0,0,0,0,0,0,0,0,0,0,0,0,0,0,0,0,0,{"$f":"AI358*AI130","v":0},0,0,0,0,0,0,0,0,0,0,0,0,0,0,0,0,0,0,0,0,0,0,0,0,0,0,0]
[null,"K26",{"$f":"IF(C133=\"\",0,VLOOKUP(C133,Düngemittel,9,FALSE))","v":0},0,0,0,0,0,0,0,0,0,0,0,0,0,0,0,0,0,0,0,0,0,0,0,0,0,0,0,0,0,0,0,{"$f":"IF(AI133=\"\",0,VLOOKUP(AI133,Düngemittel,9,FALSE))","v":0},0,0,0,0,0,0,0,0,0,0,0,0,0,0,0,0,0,0,0,0,0,0,0,0,0,0,0]
[1,null,{"$f":"C360*C135","v":0},0,0,0,0,0,0,0,0,0,0,0,0,0,0,0,0,0,0,0,0,0,0,0,0,0,0,0,0,0,0,0,{"$f":"AI360*AI135","v":0},0,0,0,0,0,0,0,0,0,0,0,0,0,0,0,0,0,0,0,0,0,0,0,0,0,0,0]
[null,"K27",{"$f":"IF(C138=\"\",0,VLOOKUP(C138,Düngemittel,9,FALSE))","v":0},0,0,0,0,0,0,0,0,0,0,0,0,0,0,0,0,0,0,0,0,0,0,0,0,0,0,0,0,0,0,0,{"$f":"IF(AI138=\"\",0,VLOOKUP(AI138,Düngemittel,9,FALSE))","v":0},0,0,0,0,0,0,0,0,0,0,0,0,0,0,0,0,0,0,0,0,0,0,0,0,0,0,0]
[1,null,{"$f":"C362*C140","v":0},0,0,0,0,0,0,0,0,0,0,0,0,0,0,0,0,0,0,0,0,0,0,0,0,0,0,0,0,0,0,0,{"$f":"AI362*AI140","v":0},0,0,0,0,0,0,0,0,0,0,0,0,0,0,0,0,0,0,0,0,0,0,0,0,0,0,0]
[null,"K28",{"$f":"IF(C143=\"\",0,VLOOKUP(C143,Düngemittel,9,FALSE))","v":0},0,0,0,0,0,0,0,0,0,0,0,0,0,0,0,0,0,0,0,0,0,0,0,0,0,0,0,0,0,0,0,{"$f":"IF(AI143=\"\",0,VLOOKUP(AI143,Düngemittel,9,FALSE))","v":0},0,0,0,0,0,0,0,0,0,0,0,0,0,0,0,0,0,0,0,0,0,0,0,0,0,0,0]
[1,null,{"$f":"C364*C145","v":0},0,0,0,0,0,0,0,0,0,0,0,0,0,0,0,0,0,0,0,0,0,0,0,0,0,0,0,0,0,0,0,{"$f":"AI364*AI145","v":0},0,0,0,0,0,0,0,0,0,0,0,0,0,0,0,0,0,0,0,0,0,0,0,0,0,0,0]
[null,"K29",{"$f":"IF(C148=\"\",0,VLOOKUP(C148,Düngemittel,9,FALSE))","v":0},0,0,0,0,0,0,0,0,0,0,0,0,0,0,0,0,0,0,0,0,0,0,0,0,0,0,0,0,0,0,0,{"$f":"IF(AI148=\"\",0,VLOOKUP(AI148,Düngemittel,9,FALSE))","v":0},0,0,0,0,0,0,0,0,0,0,0,0,0,0,0,0,0,0,0,0,0,0,0,0,0,0,0]
[1,null,{"$f":"C366*C150","v":0},0,0,0,0,0,0,0,0,0,0,0,0,0,0,0,0,0,0,0,0,0,0,0,0,0,0,0,0,0,0,0,{"$f":"AI366*AI150","v":0},0,0,0,0,0,0,0,0,0,0,0,0,0,0,0,0,0,0,0,0,0,0,0,0,0,0,0]
[null,"K30",{"$f":"IF(C153=\"\",0,VLOOKUP(C153,Düngemittel,9,FALSE))","v":0},0,0,0,0,0,0,0,0,0,0,0,0,0,0,0,0,0,0,0,0,0,0,0,0,0,0,0,0,0,0,0,{"$f":"IF(AI153=\"\",0,VLOOKUP(AI153,Düngemittel,9,FALSE))","v":0},0,0,0,0,0,0,0,0,0,0,0,0,0,0,0,0,0,0,0,0,0,0,0,0,0,0,0]
[1,null,{"$f":"C368*C155","v":0},0,0,0,0,0,0,0,0,0,0,0,0,0,0,0,0,0,0,0,0,0,0,0,0,0,0,0,0,0,0,0,{"$f":"AI368*AI155","v":0},0,0,0,0,0,0,0,0,0,0,0,0,0,0,0,0,0,0,0,0,0,0,0,0,0,0,0]
[null,"K31",{"$f":"IF(C158=\"\",0,VLOOKUP(C158,Düngemittel,9,FALSE))","v":0},0,0,0,0,0,0,0,0,0,0,0,0,0,0,0,0,0,0,0,0,0,0,0,0,0,0,0,0,0,0,0,{"$f":"IF(AI158=\"\",0,VLOOKUP(AI158,Düngemittel,9,FALSE))","v":0},0,0,0,0,0,0,0,0,0,0,0,0,0,0,0,0,0,0,0,0,0,0,0,0,0,0,0]
[1,null,{"$f":"C370*C160","v":0},0,0,0,0,0,0,0,0,0,0,0,0,0,0,0,0,0,0,0,0,0,0,0,0,0,0,0,0,0,0,0,{"$f":"AI370*AI160","v":0},0,0,0,0,0,0,0,0,0,0,0,0,0,0,0,0,0,0,0,0,0,0,0,0,0,0,0]

{"sheet":"Saatgut","index":3,"n_rows":16,"n_cols":63,"rows_kept":16,"cut":false,"hidden":false,"merged":[]}
[null,null,null,"Saatgut/Pflanzgut"]
[]
[null,"Schlag",{"$f":"Betriebsdaten!C11","v":"Bester Feld"},{"$f":"Betriebsdaten!D11","v":0},{"$f":"Betriebsdaten!E11","v":0},{"$f":"Betriebsdaten!F11","v":0},{"$f":"Betriebsdaten!G11","v":0},{"$f":"Betriebsdaten!H11","v":0},{"$f":"Betriebsdaten!I11","v":0},{"$f":"Betriebsdaten!J11","v":0},{"$f":"Betriebsdaten!K11","v":0},{"$f":"Betriebsdaten!L11","v":0},{"$f":"Betriebsdaten!M11","v":0},{"$f":"Betriebsdaten!N11","v":0},{"$f":"Betriebsdaten!O11","v":0},{"$f":"Betriebsdaten!P11","v":0},{"$f":"Betriebsdaten!Q11","v":0},{"$f":"Betriebsdaten!R11","v":0},{"$f":"Betriebsdaten!S11","v":0},{"$f":"Betriebsdaten!T11","v":0},{"$f":"Betriebsdaten!U11","v":0},{"$f":"Betriebsdaten!V11","v":0},{"$f":"Betriebsdaten!W11","v":0},{"$f":"Betriebsdaten!X11","v":0},{"$f":"Betriebsdaten!Y11","v":0},{"$f":"Betriebsdaten!Z11","v":0},{"$f":"Betriebsdaten!AA11","v":25},{"$f":"Betriebsdaten!AB11","v":26},{"$f":"Betriebsdaten!AC11","v":27},{"$f":"Betriebsdaten!AD11","v":28},{"$f":"Betriebsdaten!AE11","v":29},{"$f":"Betriebsdaten!AF11","v":30},{"$f":"Betriebsdaten!AG11","v":31},{"$f":"Betriebsdaten!AH11","v":32},{"$f":"Betriebsdaten!AI11","v":33},{"$f":"Betriebsdaten!AJ11","v":34},{"$f":"Betriebsdaten!AK11","v":35},{"$f":"Betriebsdaten!AL11","v":36},{"$f":"Betriebsdaten!AM11","v":37},{"$f":"Betriebsdaten!AN11","v":38},{"$f":"Betriebsdaten!AO11","v":39},{"$f":"Betriebsdaten!AP11","v":40},{"$f":"Betriebsdaten!AQ11","v":41},{"$f":"Betriebsdaten!AR11","v":42},{"$f":"Betriebsdaten!AS11","v":43},{"$f":"Betriebsdaten!AT11","v":44},{"$f":"Betriebsdaten!AU11","v":45},{"$f":"Betriebsdaten!AV11","v":46},{"$f":"Betriebsdaten!AW11","v":47},{"$f":"Betriebsdaten!AX11","v":48},{"$f":"Betriebsdaten!AY11","v":49},{"$f":"Betriebsdaten!AZ11","v":50},{"$f":"Betriebsdaten!BA11","v":51},{"$f":"Betriebsdaten!BB11","v":52},{"$f":"Betriebsdaten!BC11","v":53},{"$f":"Betriebsdaten!BD11","v":54},{"$f":"Betriebsdaten!BE11","v":55},{"$f":"Betriebsdaten!BF11","v":56},{"$f":"Betriebsdaten!BG11","v":57},{"$f":"Betriebsdaten!BH11","v":58},{"$f":"Betriebsdaten!BI11","v":59},{"$f":"Betriebsdaten!BJ11","v":60}]
[null,"Frucht",{"$f":"Betriebsdaten!C15","v":"Spargel"},{"$f":"Betriebsdaten!D15","v":0},{"$f":"Betriebsdaten!E15","v":0},{"$f":"Betriebsdaten!F15","v":0},{"$f":"Betriebsdaten!G15","v":0},{"$f":"Betriebsdaten!H15","v":0},{"$f":"Betriebsdaten!I15","v":0},{"$f":"Betriebsdaten!J15","v":0},{"$f":"Betriebsdaten!K15","v":0},{"$f":"Betriebsdaten!L15","v":0},{"$f":"Betriebsdaten!M15","v":0},{"$f":"Betriebsdaten!N15","v":0},{"$f":"Betriebsdaten!O15","v":0},{"$f":"Betriebsdaten!P15","v":0},{"$f":"Betriebsdaten!Q15","v":0},{"$f":"Betriebsdaten!R15","v":0},{"$f":"Betriebsdaten!S15","v":0},{"$f":"Betriebsdaten!T15","v":0},{"$f":"Betriebsdaten!U15","v":0},{"$f":"Betriebsdaten!V15","v":0},{"$f":"Betriebsdaten!W15","v":0},{"$f":"Betriebsdaten!X15","v":0},{"$f":"Betriebsdaten!Y15","v":0},{"$f":"Betriebsdaten!Z15","v":0},{"$f":"Betriebsdaten!AA15","v":0},{"$f":"Betriebsdaten!AB15","v":0},{"$f":"Betriebsdaten!AC15","v":0},{"$f":"Betriebsdaten!AD15","v":0},{"$f":"Betriebsdaten!AE15","v":0},{"$f":"Betriebsdaten!AF15","v":0},{"$f":"Betriebsdaten!AG15","v":0},{"$f":"Betriebsdaten!AH15","v":0},{"$f":"Betriebsdaten!AI15","v":0},{"$f":"Betriebsdaten!AJ15","v":0},{"$f":"Betriebsdaten!AK15","v":0},{"$f":"Betriebsdaten!AL15","v":0},{"$f":"Betriebsdaten!AM15","v":0},{"$f":"Betriebsdaten!AN15","v":0},{"$f":"Betriebsdaten!AO15","v":0},{"$f":"Betriebsdaten!AP15","v":0},{"$f":"Betriebsdaten!AQ15","v":0},{"$f":"Betriebsdaten!AR15","v":0},{"$f":"Betriebsdaten!AS15","v":0},{"$f":"Betriebsdaten!AT15","v":0},{"$f":"Betriebsdaten!AU15","v":0},{"$f":"Betriebsdaten!AV15","v":0},{"$f":"Betriebsdaten!AW15","v":0},{"$f":"Betriebsdaten!AX15","v":0},{"$f":"Betriebsdaten!AY15","v":0},{"$f":"Betriebsdaten!AZ15","v":0},{"$f":"Betriebsdaten!BA15","v":0},{"$f":"Betriebsdaten!BB15","v":0},{"$f":"Betriebsdaten!BC15","v":0},{"$f":"Betriebsdaten!BD15","v":0},{"$f":"Betriebsdaten!BE15","v":0},{"$f":"Betriebsdaten!BF15","v":0},{"$f":"Betriebsdaten!BG15","v":0},{"$f":"Betriebsdaten!BH15","v":0},{"$f":"Betriebsdaten!BI15","v":0},{"$f":"Betriebsdaten!BJ15","v":0}]
[null,"Sorte",{"$f":"Betriebsdaten!C16","v":"Gijnlim"},{"$f":"Betriebsdaten!D16","v":0},{"$f":"Betriebsdaten!E16","v":0},{"$f":"Betriebsdaten!F16","v":0},{"$f":"Betriebsdaten!G16","v":0},{"$f":"Betriebsdaten!H16","v":0},{"$f":"Betriebsdaten!I16","v":0},{"$f":"Betriebsdaten!J16","v":0},{"$f":"Betriebsdaten!K16","v":0},{"$f":"Betriebsdaten!L16","v":0},{"$f":"Betriebsdaten!M16","v":0},{"$f":"Betriebsdaten!N16","v":0},{"$f":"Betriebsdaten!O16","v":0},{"$f":"Betriebsdaten!P16","v":0},{"$f":"Betriebsdaten!Q16","v":0},{"$f":"Betriebsdaten!R16","v":0},{"$f":"Betriebsdaten!S16","v":0},{"$f":"Betriebsdaten!T16","v":0},{"$f":"Betriebsdaten!U16","v":0},{"$f":"Betriebsdaten!V16","v":0},{"$f":"Betriebsdaten!W16","v":0},{"$f":"Betriebsdaten!X16","v":0},{"$f":"Betriebsdaten!Y16","v":0},{"$f":"Betriebsdaten!Z16","v":0},{"$f":"Betriebsdaten!AA16","v":0},{"$f":"Betriebsdaten!AB16","v":0},{"$f":"Betriebsdaten!AC16","v":0},{"$f":"Betriebsdaten!AD16","v":0},{"$f":"Betriebsdaten!AE16","v":0},{"$f":"Betriebsdaten!AF16","v":0},{"$f":"Betriebsdaten!AG16","v":0},{"$f":"Betriebsdaten!AH16","v":0},{"$f":"Betriebsdaten!AI16","v":0},{"$f":"Betriebsdaten!AJ16","v":0},{"$f":"Betriebsdaten!AK16","v":0},{"$f":"Betriebsdaten!AL16","v":0},{"$f":"Betriebsdaten!AM16","v":0},{"$f":"Betriebsdaten!AN16","v":0},{"$f":"Betriebsdaten!AO16","v":0},{"$f":"Betriebsdaten!AP16","v":0},{"$f":"Betriebsdaten!AQ16","v":0},{"$f":"Betriebsdaten!AR16","v":0},{"$f":"Betriebsdaten!AS16","v":0},{"$f":"Betriebsdaten!AT16","v":0},{"$f":"Betriebsdaten!AU16","v":0},{"$f":"Betriebsdaten!AV16","v":0},{"$f":"Betriebsdaten!AW16","v":0},{"$f":"Betriebsdaten!AX16","v":0},{"$f":"Betriebsdaten!AY16","v":0},{"$f":"Betriebsdaten!AZ16","v":0},{"$f":"Betriebsdaten!BA16","v":0},{"$f":"Betriebsdaten!BB16","v":0},{"$f":"Betriebsdaten!BC16","v":0},{"$f":"Betriebsdaten!BD16","v":0},{"$f":"Betriebsdaten!BE16","v":0},{"$f":"Betriebsdaten!BF16","v":0},{"$f":"Betriebsdaten!BG16","v":0},{"$f":"Betriebsdaten!BH16","v":0},{"$f":"Betriebsdaten!BI16","v":0},{"$f":"Betriebsdaten!BJ16","v":0}]
[null,"ha",{"$f":"Betriebsdaten!C17","v":3.8},{"$f":"Betriebsdaten!D17","v":0},{"$f":"Betriebsdaten!E17","v":0},{"$f":"Betriebsdaten!F17","v":0},{"$f":"Betriebsdaten!G17","v":0},{"$f":"Betriebsdaten!H17","v":0},{"$f":"Betriebsdaten!I17","v":0},{"$f":"Betriebsdaten!J17","v":0},{"$f":"Betriebsdaten!K17","v":0},{"$f":"Betriebsdaten!L17","v":0},{"$f":"Betriebsdaten!M17","v":0},{"$f":"Betriebsdaten!N17","v":0},{"$f":"Betriebsdaten!O17","v":0},{"$f":"Betriebsdaten!P17","v":0},{"$f":"Betriebsdaten!Q17","v":0},{"$f":"Betriebsdaten!R17","v":0},{"$f":"Betriebsdaten!S17","v":0},{"$f":"Betriebsdaten!T17","v":0},{"$f":"Betriebsdaten!U17","v":0},{"$f":"Betriebsdaten!V17","v":0},{"$f":"Betriebsdaten!W17","v":0},{"$f":"Betriebsdaten!X17","v":0},{"$f":"Betriebsdaten!Y17","v":0},{"$f":"Betriebsdaten!Z17","v":0},{"$f":"Betriebsdaten!AA17","v":0},{"$f":"Betriebsdaten!AB17","v":0},{"$f":"Betriebsdaten!AC17","v":0},{"$f":"Betriebsdaten!AD17","v":0},{"$f":"Betriebsdaten!AE17","v":0},{"$f":"Betriebsdaten!AF17","v":0},{"$f":"Betriebsdaten!AG17","v":0},{"$f":"Betriebsdaten!AH17","v":0},{"$f":"Betriebsdaten!AI17","v":0},{"$f":"Betriebsdaten!AJ17","v":0},{"$f":"Betriebsdaten!AK17","v":0},{"$f":"Betriebsdaten!AL17","v":0},{"$f":"Betriebsdaten!AM17","v":0},{"$f":"Betriebsdaten!AN17","v":0},{"$f":"Betriebsdaten!AO17","v":0},{"$f":"Betriebsdaten!AP17","v":0},{"$f":"Betriebsdaten!AQ17","v":0},{"$f":"Betriebsdaten!AR17","v":0},{"$f":"Betriebsdaten!AS17","v":0},{"$f":"Betriebsdaten!AT17","v":0},{"$f":"Betriebsdaten!AU17","v":0},{"$f":"Betriebsdaten!AV17","v":0},{"$f":"Betriebsdaten!AW17","v":0},{"$f":"Betriebsdaten!AX17","v":0},{"$f":"Betriebsdaten!AY17","v":0},{"$f":"Betriebsdaten!AZ17","v":0},{"$f":"Betriebsdaten!BA17","v":0},{"$f":"Betriebsdaten!BB17","v":0},{"$f":"Betriebsdaten!BC17","v":0},{"$f":"Betriebsdaten!BD17","v":0},{"$f":"Betriebsdaten!BE17","v":0},{"$f":"Betriebsdaten!BF17","v":0},{"$f":"Betriebsdaten!BG17","v":0},{"$f":"Betriebsdaten!BH17","v":0},{"$f":"Betriebsdaten!BI17","v":0},{"$f":"Betriebsdaten!BJ17","v":0}]
[null,"Datum Saat/Pflanzung","2014-04-13"]
[null,"Saatmenge/ha     (dt, kg, Pflanzen )",16000]
[null,"Beizmittel"]
[null,"ml/dt  ml/100l  "]
[null,"Preis",0.31]
[null,"Ertragsjahre",6]
[null,"€/ha/Jahr",{"$f":"IF(C12=\"\",0,(C15/C12))","v":826.66666666666663},0,0,0,0,0,0,0,0,0,0,0,0,0,0,0,0,0,0,0,{"$f":"IF(W12=\"\",0,(W15/W12))","v":0},0,0,0,0,0,0,0,0,0,{"$f":"IF(AG12=\"\",0,(AG15/AG12))","v":0},0,0,0,0,0,0,0,0,0,0,0,0,0,0,0,0,0,0,0,0,0,0,0,0,0,0,0,0,0]
[null,"gekauft bei"]
[null,"Kosten/ha",{"$f":"C11*C8","v":4960},{"$f":"D11*D8","v":0},{"$f":"E11*E8","v":0},0,0,0,0,0,0,0,0,0,0,0,0,0,0,0,0,0,{"$f":"W11*W8","v":0},0,0,0,0,0,0,0,0,0,{"$f":"AG11*AG8","v":0},0,0,0,0,0,0,0,0,0,0,0,0,0,0,0,0,0,0,0,0,0,0,0,0,0,0,0,0,0]
[null,"Kosten gesamt",{"$f":"C6*C15","v":18848},0,0,0,0,0,0,0,0,0,0,0,0,0,0,0,0,0,0,0,{"$f":"W6*W15","v":0},0,0,0,0,0,0,0,0,0,{"$f":"AG6*AG15","v":0},0,0,0,0,0,0,0,0,0,0,0,0,0,0,0,0,0,0,0,0,0,0,0,0,0,0,0,0,0,{"$f":"SUM(C16:BJ16)","v":18848}]

{"sheet":"Kosten","index":4,"n_rows":222,"n_cols":14,"rows_kept":222,"cut":false,"hidden":false,"merged":[]}
[]
[null,null,null,null,null,"Hilfe"]
[]
[null,null,"Art","Kosten pro","Anzahl","Kosten/ha"]
[null,null,null,"Maßnahme/ha","Maßnahmen","gesamt"]
[]
[null,"Saatbeetbereitung"]
[null,"1.","Grubbern",25,2,{"$f":"IF(D8=\"\",\"\",(E8*D8))","v":50}]
[null,"2.","Pflügen",28,1,{"$f":"IF(D9=\"\",\"\",(E9*D9))","v":28}]
[null,"3.","Eggen",16,3,48]
[null,"4.",null,null,null,""]
[null,"5.",null,null,null,""]
[null,"6.",null,null,null,""]
[null,"7.",null,null,null,""]
[null,"8.",null,null,null,""]
[null,"9.",null,null,null,""]
[null,"10.",null,null,null,""]
[]
[null,"Bestellung,Düngung"]
[null,"1.","Getreide säen",45,1,{"$f":"IF(D20=\"\",\"\",(E20*D20))","v":45}]
[null,"2.","Mais legen",30,1,{"$f":"IF(D21=\"\",\"\",(E21*D21))","v":30}]
[null,"3.","Kartoffeln pflanzen",90,1,90]
[null,"4.","Kalk düngen",null,null,""]
[null,"5.","mineralisch düngen",null,null,""]
[null,"6.",null,null,null,""]
[null,"7.",null,null,null,""]
[null,"8.",null,null,null,""]
[null,"9.",null,null,null,{"$f":"IF(D28=\"\",\"\",(E28*D28))","v":""}]
[null,"10.",null,null,null,{"$f":"IF(D29=\"\",\"\",(E29*D29))","v":""}]
[]
[null,"Pflegemaßnahmen"]
[null,"1.","Spargel spritzen",63,2,{"$f":"IF(D32=\"\",\"\",(E32*D32))","v":126}]
[null,"2.","Spargel spritzen",63,3,189]
[null,"3.","Spargel spritzen",63,4,252]
[null,"4.","Spargel spritzen",63,5,315]
[null,"5.","Spargel spritzen",63,6,378]
[null,"6.","Spargel spritzen",64,7,448]
[null,"7.","Spargel spritzen",65,8,520]
[null,"8.","Spargel spritzen",66,9,594]
[null,"9.","Spargel spritzen",67,10,670]
[null,"10.",null,null,null,""]
[]
[null,"Ernte"]
[null,"1.","Getreide mähen",100,1,{"$f":"IF(D44=\"\",\"\",(E44*D44))","v":100}]
[null,"2.","Mais abfahren",15,6,{"$f":"IF(D45=\"\",\"\",(E45*D45))","v":90}]
[null,"3.",null,null,10,""]
[null,"4.",null,null,null,""]
[null,"5.",null,null,null,""]
[null,"6.",null,null,null,""]
[null,"7.",null,null,null,""]
[null,"8.",null,null,null,""]
[null,"9.",null,null,null,""]
[null,"10.",null,null,null,""]
[]
[]
[]
[]
[]
[]
[]
[]
[]
[]
[]
[]
[]
[]
[]
[]
[]
[]
[]
[]
[]
[]
[]
[]
[]
[]
[]
[]
[]
[]
[]
[]
[]
[null,null,null,null,null,null,null,null,"Datum:",{"$f":"TODAY()","v":"2019-11-05"}]
[]
[null,null,null,null,null,null,null,null,"Jahr",{"$f":"YEAR(J87)","v":2019}]
[]
[]
[null,null,"Maschinen und Gebäude die für alle Früchte gebraucht werden",null,null,null,null,null,"Hilfe"]
[]
[null,null,"Art","Anschaff-","Baujahr","Afa","Zins","Reparatur","sonst.Kosten","Summe","Kosten/ha"]
[null,null,null,"ungskosten",null,"%","%","%","€","€","€"]
[null,"1.","John Deere 6530",80000,2015,10,5,5,null,{"$f":"IF(C96=\"\",\"\",IF(E96=\"\",I96,(IF((N96<=(100/F96)),((D96/2*(G96/100)+D96*(F96/100)+D96*(H96/100)+I96)),D96*H96/100))))","v":14000},{"$f":"IF(C96=\"\",\"\",(IF(J96=\"abgeschrieben\",\"\",J96/Betriebsdaten!$I$4)))","v":560},null,null,{"$f":"IF(E96=\"\",\"\",($J$89-E96))","v":4}]
[null,"2.","John Deere 6320",38000,2013,10,5,3,null,5890,{"$f":"IF(C97=\"\",\"\",(IF(J97=\"abgeschrieben\",\"\",J97/Betriebsdaten!$I$4)))","v":235.6},null,null,6]
[null,"3.","Fendt 610",18000,2014,10,5,5,null,3150,{"$f":"IF(C98=\"\",\"\",(IF(J98=\"abgeschrieben\",\"\",J98/Betriebsdaten!$I$4)))","v":126},null,null,5]
[null,"4.","Deutz",null,null,null,null,null,null,0,{"$f":"IF(C99=\"\",\"\",(IF(J99=\"abgeschrieben\",\"\",J99/Betriebsdaten!$I$4)))","v":0},null,null,""]
[null,"5.","Futtermischwagen",20000,null,null,null,null,null,0,{"$f":"IF(C100=\"\",\"\",(IF(J100=\"abgeschrieben\",\"\",J100/Betriebsdaten!$I$4)))","v":0},null,null,""]
[null,"6.","Pflug",6000,null,null,null,null,null,0,{"$f":"IF(C101=\"\",\"\",(IF(J101=\"abgeschrieben\",\"\",J101/Betriebsdaten!$I$4)))","v":0},null,null,""]
[null,"7.","Rüttelegge/Drillmaschine",5500,null,null,null,null,null,0,{"$f":"IF(C102=\"\",\"\",(IF(J102=\"abgeschrieben\",\"\",J102/Betriebsdaten!$I$4)))","v":0},null,null,""]
[null,"8.","Spritze",8000,null,null,null,null,null,0,{"$f":"IF(C103=\"\",\"\",(IF(J103=\"abgeschrieben\",\"\",J103/Betriebsdaten!$I$4)))","v":0},null,null,""]
[null,"9.","Düngerstreuer",2000,2004,10,null,null,null,0,{"$f":"IF(C104=\"\",\"\",(IF(J104=\"abgeschrieben\",\"\",J104/Betriebsdaten!$I$4)))","v":0},null,null,15]
[null,"10.","Güllefass",6000,1999,16,2,5,null,300,{"$f":"IF(C105=\"\",\"\",(IF(J105=\"abgeschrieben\",\"\",J105/Betriebsdaten!$I$4)))","v":12},null,null,20]
[null,"11.",null,null,null,null,null,null,null,"",{"$f":"IF(C106=\"\",\"\",(IF(J106=\"abgeschrieben\",\"\",J106/Betriebsdaten!$I$4)))","v":""},null,null,""]
[null,"12.",null,null,null,null,null,null,null,"",{"$f":"IF(C107=\"\",\"\",(IF(J107=\"abgeschrieben\",\"\",J107/Betriebsdaten!$I$4)))","v":""},null,null,""]
[null,"13.",null,null,null,null,null,null,null,"",{"$f":"IF(C108=\"\",\"\",(IF(J108=\"abgeschrieben\",\"\",J108/Betriebsdaten!$I$4)))","v":""},null,null,""]
[null,"14.",null,null,null,null,null,null,null,"",{"$f":"IF(C109=\"\",\"\",(IF(J109=\"abgeschrieben\",\"\",J109/Betriebsdaten!$I$4)))","v":""},null,null,""]
[null,"15.",null,null,null,null,null,null,null,"",{"$f":"IF(C110=\"\",\"\",(IF(J110=\"abgeschrieben\",\"\",J110/Betriebsdaten!$I$4)))","v":""},null,null,""]
[null,"16.",null,null,null,null,null,null,null,"",{"$f":"IF(C111=\"\",\"\",(IF(J111=\"abgeschrieben\",\"\",J111/Betriebsdaten!$I$4)))","v":""},null,null,""]
[null,"17.",null,null,null,null,null,null,null,"",{"$f":"IF(C112=\"\",\"\",(IF(J112=\"abgeschrieben\",\"\",J112/Betriebsdaten!$I$4)))","v":""},null,null,""]
[null,"18.",null,null,null,null,null,null,null,"",{"$f":"IF(C113=\"\",\"\",(IF(J113=\"abgeschrieben\",\"\",J113/Betriebsdaten!$I$4)))","v":""},null,null,""]
[null,"19.",null,null,null,null,null,null,null,"",{"$f":"IF(C114=\"\",\"\",(IF(J114=\"abgeschrieben\",\"\",J114/Betriebsdaten!$I$4)))","v":""},null,null,""]
[null,"20.",null,null,null,null,null,null,null,"",{"$f":"IF(C115=\"\",\"\",(IF(J115=\"abgeschrieben\",\"\",J115/Betriebsdaten!$I$4)))","v":""},null,null,""]
[null,"21.",null,null,null,null,null,null,null,"",{"$f":"IF(C116=\"\",\"\",(IF(J116=\"abgeschrieben\",\"\",J116/Betriebsdaten!$I$4)))","v":""},null,null,""]
[null,"22.",null,null,null,null,null,null,null,"",{"$f":"IF(C117=\"\",\"\",(IF(J117=\"abgeschrieben\",\"\",J117/Betriebsdaten!$I$4)))","v":""},null,null,""]
[null,"23.",null,null,null,null,null,null,null,"",{"$f":"IF(C118=\"\",\"\",(IF(J118=\"abgeschrieben\",\"\",J118/Betriebsdaten!$I$4)))","v":""},null,null,""]
[null,"24.",null,null,null,null,null,null,null,"",{"$f":"IF(C119=\"\",\"\",(IF(J119=\"abgeschrieben\",\"\",J119/Betriebsdaten!$I$4)))","v":""},null,null,""]
[null,"25.",null,null,null,null,null,null,null,"",{"$f":"IF(C120=\"\",\"\",(IF(J120=\"abgeschrieben\",\"\",J120/Betriebsdaten!$I$4)))","v":""},null,null,""]
[null,"26.",null,null,null,null,null,null,null,"",{"$f":"IF(C121=\"\",\"\",(IF(J121=\"abgeschrieben\",\"\",J121/Betriebsdaten!$I$4)))","v":""},null,null,""]
[null,"27.","Maschinenhalle",42000,2016,10,5,1,null,5670,{"$f":"IF(C122=\"\",\"\",(IF(J122=\"abgeschrieben\",\"\",J122/Betriebsdaten!$I$4)))","v":226.8},null,null,3]
[null,"28.","Werkstatt",15600,2004,10,5,2,null,312,{"$f":"IF(C123=\"\",\"\",(IF(J123=\"abgeschrieben\",\"\",J123/Betriebsdaten!$I$4)))","v":12.48},null,null,15]
[null,"29.",null,null,null,null,null,null,null,"",{"$f":"IF(C124=\"\",\"\",(IF(J124=\"abgeschrieben\",\"\",J124/Betriebsdaten!$I$4)))","v":""},null,null,""]
[null,"30.",null,null,null,null,null,null,null,"",{"$f":"IF(C125=\"\",\"\",(IF(J125=\"abgeschrieben\",\"\",J125/Betriebsdaten!$I$4)))","v":""},null,null,""]
[null,null,null,{"$f":"SUM(D96:D125)","v":241100},null,null,null,null,null,{"$f":"SUM(J96:J125)","v":29322},{"$f":"SUM(K96:K125)","v":1172.8800000000001}]
[null,null,"Feste Kosten pro ha",{"$f":"K126","v":1172.8800000000001}]
[]
[null,null,"Maschinen und Gebäude die nur für bestimmte Früchte benötigt werden"]
[]
[]
[null,null,"Art","Anschaff-","Baujahr","Afa","Zins","Reparatur","sonst.Kosten","Summe","Einsatzfläche","Kosten"]
[null,null,null,"ungskosten",null,"%","%","%","€","€","ha","ha"]
[null,"31.","Kartoffelroder",28000,2012,10,5,6,null,{"$f":"IF(C134=\"\",\"\",IF(E134=\"\",I134,(IF((N134<=(100/F134)),((D134/2*(G134/100)+D134*(F134/100)+D134*(H134/100)+I134)),D134*H134/100))))","v":5180},11,{"$f":"IF(K134=\"\",\"\",(J134/K134))","v":470.90909090909093},null,{"$f":"IF(E134=\"\",\"\",($J$89-E134))","v":7}]
[null,"32.","Kartoffelpflanzm.",21000,2016,10,5,5,null,{"$f":"IF(C135=\"\",\"\",IF(E135=\"\",I135,(IF((N135<=(100/F135)),((D135/2*(G135/100)+D135*(F135/100)+D135*(H135/100)+I135)),D135*H135/100))))","v":3675},11,{"$f":"IF(K135=\"\",\"\",(J135/K135))","v":334.09090909090907},null,3]
[null,"33.","Sortierband",4200,2007,10,5,5,null,210,11,{"$f":"IF(K136=\"\",\"\",(J136/K136))","v":19.09090909090909},null,12]
[null,"34.","Boxenfüller",6900,2013,10,5,5,null,1207.5,11,109.77272727272727,null,6]
[null,"35.",null,null,null,null,null,null,null,"",null,"",null,""]
[null,"36.",null,null,null,null,null,null,null,"",null,"",null,""]
[null,"37.",null,null,null,null,null,null,null,"",null,"",null,""]
[null,"38.",null,null,null,null,null,null,null,"",null,"",null,""]
[null,"39.",null,null,null,null,null,null,null,"",null,"",null,""]
[null,"40.",null,null,null,null,null,null,null,"",null,"",null,""]
[null,"41.",null,null,null,null,null,null,null,"",null,"",null,""]
[null,"42.",null,null,null,null,null,null,null,"",null,"",null,""]
[null,"43.",null,null,null,null,null,null,null,"",null,"",null,""]
[null,"44.",null,null,null,null,null,null,null,"",null,"",null,""]
[null,"45.",null,null,null,null,null,null,null,"",null,"",null,""]
[null,"46.",null,null,null,null,null,null,null,"",null,"",null,""]
[null,"47.",null,null,null,null,null,null,null,"",null,"",null,""]
[null,"48.",null,null,null,null,null,null,null,"",null,"",null,""]
[null,"49.",null,null,null,null,null,null,null,"",null,"",null,""]
[null,"50.",null,null,null,null,null,null,null,"",null,"",null,""]
[null,"51.",null,null,null,null,null,null,null,"",null,"",null,""]
[null,"52.",null,null,null,null,null,null,null,"",null,"",null,""]
[null,"53.",null,null,null,null,null,null,null,"",null,"",null,""]
[null,"54.",null,null,null,null,null,null,null,"",null,"",null,""]
[null,"55.",null,null,null,null,null,null,null,"",null,"",null,""]
[null,"56.",null,null,null,null,null,null,null,"",null,"",null,""]
[null,"57.","Kühlraum Kartoffeln",35000,2013,10,5,2,null,5075,11,461.36363636363637,null,6]
[null,"58.","Kistenlager",18500,2008,10,5,2,null,370,11,33.636363636363633,null,11]
[null,"59.",null,null,null,null,null,null,null,"",null,"",null,""]
[null,"60.",null,null,null,null,null,null,null,"",null,{"$f":"IF(K163=\"\",\"\",(J163/K163))","v":""},null,""]
[null,null,null,{"$f":"SUM(D134:D163)","v":113600},null,null,null,null,null,{"$f":"SUM(J134:J163)","v":15717.5},null,{"$f":"SUM(L134:L163)","v":1428.8636363636365},null,""]
[]
[]
[]
[]
[]
[null,null,"Maschinen und Gebäude die nur für den Spargel benötigt werden"]
[]
[]
[null,null,"Art","Anschaff-","Anzahl","Baujahr","Afa","Zins","Reparatur","sonst.Kosten","Summe","Einsatzfläche","Kosten"]
[null,null,null,"ungskosten","Stk.",null,"%","%","%","€","€","ha","ha"]
[null,"61.","Abschneideband grün",6500,1,2011,10,5,2,null,{"$f":"IF(C175=\"\",\"\",IF(F175=\"\",J175,(IF((N175<=(100/G175)),(((D175*E175)/2*(H175/100)+(D175*E175)*(G175/100)+(D175*E175)*(I175/100)+J175)),(D175*E175)*I175/100))))","v":942.5},2,{"$f":"IF(L175=\"\",\"\",(K175/L175))","v":471.25},{"$f":"IF(F175=\"\",\"\",($J$89-F175))","v":8}]
[null,"62.","Sortiermaschine",76000,1,2017,10,5,5,null,{"$f":"IF(C176=\"\",\"\",IF(F176=\"\",J176,(IF((N176<=(100/G176)),(((D176*E176)/2*(H176/100)+(D176*E176)*(G176/100)+(D176*E176)*(I176/100)+J176)),(D176*E176)*I176/100))))","v":13300},22,604.5454545454545,{"$f":"IF(F176=\"\",\"\",($J$89-F176))","v":2}]
[null,"63.","Schockschrank",28000,1,2018,10,5,5,null,{"$f":"IF(C177=\"\",\"\",IF(F177=\"\",J177,(IF((N177<=(100/G177)),(((D177*E177)/2*(H177/100)+(D177*E177)*(G177/100)+(D177*E177)*(I177/100)+J177)),(D177*E177)*I177/100))))","v":4900},22,222.72727272727272,1]
[null,"64.","Schälmaschine",29000,1,2017,10,5,5,180,5255,22,238.86363636363637,2]
[null,"65.","Holder",10800,1,2016,10,5,5,null,1890,22,85.909090909090907,3]
[null,"66.","Dammfräse (1/2)",5000,1,2017,10,5,5,null,875,22,39.772727272727273,2]
[null,"67.","Tiefenhacken",1800,1,2015,10,5,2,null,261,22,11.863636363636363,4]
[null,"68.","Folienwickler (1/2)",2500,1,2018,10,5,2,null,362.5,22,16.477272727272727,1]
[null,"69.","Folienleger (1/2)",1500,1,1990,10,5,3,null,45,22,2.0454545454545454,29]
[null,"70.","Häcksler",3200,1,1990,10,5,5,null,160,22,7.2727272727272725,29]
[null,"71.",null,null,null,null,null,null,null,null,"",null,{"$f":"IF(L185=\"\",\"\",(K185/L185))","v":""},""]
[null,"72.",null,null,null,null,null,null,null,null,"",null,"",""]
[null,"73.",null,null,null,null,null,null,null,null,"",null,"",""]
[null,"74.",null,null,null,null,null,null,null,null,"",null,"",""]
[null,"75.",null,null,null,null,null,null,null,null,"",null,"",""]
[null,"76.",null,null,null,null,null,null,null,null,"",null,"",""]
[null,"77.",null,null,null,null,null,null,null,null,"",null,"",""]
[null,"78.",null,null,null,null,null,null,null,null,"",null,"",""]
[null,"79.",null,null,null,null,null,null,null,null,"",null,"",""]
[null,"80.",null,null,null,null,null,null,null,null,"",null,"",""]
[null,"81.",null,null,null,null,null,null,null,null,"",null,"",""]
[null,"82.",null,null,null,null,null,null,null,null,"",null,"",""]
[null,"83.",null,null,null,null,null,null,null,null,"",null,"",""]
[null,"84.",null,null,null,null,null,null,null,null,"",null,"",""]
[null,"85.",null,null,null,null,null,null,null,null,"",null,"",""]
[null,"86.",null,null,null,null,null,null,null,null,"",null,"",""]
[null,"87.",null,null,null,null,null,null,null,null,"",null,"",""]
[null,"88.",null,null,null,null,null,null,null,null,"",null,"",""]
[null,"89.",null,null,null,null,null,null,null,null,"",null,"",""]
[null,"90.",null,null,null,null,null,null,null,null,"",null,"",""]
[null,"91.",null,null,null,null,null,null,null,null,"",null,"",""]
[null,"92.",null,null,null,null,null,null,null,null,"",null,"",""]
[null,"93.",null,null,null,null,null,null,null,null,"",null,"",""]
[null,"94.",null,null,null,null,null,null,null,null,"",null,"",""]
[null,"95.",null,null,null,null,null,null,null,null,"",null,"",""]
[null,"96.","Kühlhaus",null,null,null,null,null,null,null,0,null,"",""]
[null,"97.","Sortierhalle",null,null,null,null,null,null,null,0,null,"",""]
[null,"98.","Verkaufsraum",null,null,null,null,null,null,null,0,null,"",""]
[null,"99.",null,null,null,null,null,null,null,null,"",null,"",""]
[null,"100.",null,null,null,null,null,null,null,null,"",null,{"$f":"IF(L214=\"\",\"\",(K214/L214))","v":""},""]
[null,null,null,{"$f":"SUM(D175:D214)","v":164300},null,null,null,null,null,null,{"$f":"SUM(K175:K214)","v":27991},null,{"$f":"SUM(M175:M214)","v":1700.7272727272725}]
[]
[null,null,"Feste Kosten Spargel ",{"$f":"M215","v":1700.7272727272725}]
[null,null,"pro ha"]
[]
[null,null,"Feste Kosten allgemein"]
[null,null," + feste Kosten Spargel",{"$f":"D217+D127","v":2873.6072727272726}]
[null,null,"je ha "]

{"sheet":"Arbeitskräfte","index":5,"n_rows":81,"n_cols":63,"rows_kept":81,"cut":false,"hidden":false,"merged":[[29,3,29,5]]}
[null,null,null,"Lohn- und Materialkosten/ha/Jahr"]
[]
[null,"Schlag",{"$f":"Betriebsdaten!C11","v":"Bester Feld"},{"$f":"Betriebsdaten!D11","v":0},{"$f":"Betriebsdaten!E11","v":0},{"$f":"Betriebsdaten!F11","v":0},{"$f":"Betriebsdaten!G11","v":0},{"$f":"Betriebsdaten!H11","v":0},{"$f":"Betriebsdaten!I11","v":0},{"$f":"Betriebsdaten!J11","v":0},{"$f":"Betriebsdaten!K11","v":0},{"$f":"Betriebsdaten!L11","v":0},{"$f":"Betriebsdaten!M11","v":0},{"$f":"Betriebsdaten!N11","v":0},{"$f":"Betriebsdaten!O11","v":0},{"$f":"Betriebsdaten!P11","v":0},{"$f":"Betriebsdaten!Q11","v":0},{"$f":"Betriebsdaten!R11","v":0},{"$f":"Betriebsdaten!S11","v":0},{"$f":"Betriebsdaten!T11","v":0},{"$f":"Betriebsdaten!U11","v":0},{"$f":"Betriebsdaten!V11","v":0},{"$f":"Betriebsdaten!W11","v":0},{"$f":"Betriebsdaten!X11","v":0},{"$f":"Betriebsdaten!Y11","v":0},{"$f":"Betriebsdaten!Z11","v":0},{"$f":"Betriebsdaten!AA11","v":25},{"$f":"Betriebsdaten!AB11","v":26},{"$f":"Betriebsdaten!AC11","v":27},{"$f":"Betriebsdaten!AD11","v":28},{"$f":"Betriebsdaten!AE11","v":29},{"$f":"Betriebsdaten!AF11","v":30},{"$f":"Betriebsdaten!AG11","v":31},{"$f":"Betriebsdaten!AH11","v":32},{"$f":"Betriebsdaten!AI11","v":33},{"$f":"Betriebsdaten!AJ11","v":34},{"$f":"Betriebsdaten!AK11","v":35},{"$f":"Betriebsdaten!AL11","v":36},{"$f":"Betriebsdaten!AM11","v":37},{"$f":"Betriebsdaten!AN11","v":38},{"$f":"Betriebsdaten!AO11","v":39},{"$f":"Betriebsdaten!AP11","v":40},{"$f":"Betriebsdaten!AQ11","v":41},{"$f":"Betriebsdaten!AR11","v":42},{"$f":"Betriebsdaten!AS11","v":43},{"$f":"Betriebsdaten!AT11","v":44},{"$f":"Betriebsdaten!AU11","v":45},{"$f":"Betriebsdaten!AV11","v":46},{"$f":"Betriebsdaten!AW11","v":47},{"$f":"Betriebsdaten!AX11","v":48},{"$f":"Betriebsdaten!AY11","v":49},{"$f":"Betriebsdaten!AZ11","v":50},{"$f":"Betriebsdaten!BA11","v":51},{"$f":"Betriebsdaten!BB11","v":52},{"$f":"Betriebsdaten!BC11","v":53},{"$f":"Betriebsdaten!BD11","v":54},{"$f":"Betriebsdaten!BE11","v":55},{"$f":"Betriebsdaten!BF11","v":56},{"$f":"Betriebsdaten!BG11","v":57},{"$f":"Betriebsdaten!BH11","v":58},{"$f":"Betriebsdaten!BI11","v":59},{"$f":"Betriebsdaten!BJ11","v":60},"Summe"]
[null,"Frucht",{"$f":"Betriebsdaten!C15","v":"Spargel"},{"$f":"Betriebsdaten!D15","v":0},{"$f":"Betriebsdaten!E15","v":0},{"$f":"Betriebsdaten!F15","v":0},{"$f":"Betriebsdaten!G15","v":0},{"$f":"Betriebsdaten!H15","v":0},{"$f":"Betriebsdaten!I15","v":0},{"$f":"Betriebsdaten!J15","v":0},{"$f":"Betriebsdaten!K15","v":0},{"$f":"Betriebsdaten!L15","v":0},{"$f":"Betriebsdaten!M15","v":0},{"$f":"Betriebsdaten!N15","v":0},{"$f":"Betriebsdaten!O15","v":0},{"$f":"Betriebsdaten!P15","v":0},{"$f":"Betriebsdaten!Q15","v":0},{"$f":"Betriebsdaten!R15","v":0},{"$f":"Betriebsdaten!S15","v":0},{"$f":"Betriebsdaten!T15","v":0},{"$f":"Betriebsdaten!U15","v":0},{"$f":"Betriebsdaten!V15","v":0},{"$f":"Betriebsdaten!W15","v":0},{"$f":"Betriebsdaten!X15","v":0},{"$f":"Betriebsdaten!Y15","v":0},{"$f":"Betriebsdaten!Z15","v":0},{"$f":"Betriebsdaten!AA15","v":0},{"$f":"Betriebsdaten!AB15","v":0},{"$f":"Betriebsdaten!AC15","v":0},{"$f":"Betriebsdaten!AD15","v":0},{"$f":"Betriebsdaten!AE15","v":0},{"$f":"Betriebsdaten!AF15","v":0},{"$f":"Betriebsdaten!AG15","v":0},{"$f":"Betriebsdaten!AH15","v":0},{"$f":"Betriebsdaten!AI15","v":0},{"$f":"Betriebsdaten!AJ15","v":0},{"$f":"Betriebsdaten!AK15","v":0},{"$f":"Betriebsdaten!AL15","v":0},{"$f":"Betriebsdaten!AM15","v":0},{"$f":"Betriebsdaten!AN15","v":0},{"$f":"Betriebsdaten!AO15","v":0},{"$f":"Betriebsdaten!AP15","v":0},{"$f":"Betriebsdaten!AQ15","v":0},{"$f":"Betriebsdaten!AR15","v":0},{"$f":"Betriebsdaten!AS15","v":0},{"$f":"Betriebsdaten!AT15","v":0},{"$f":"Betriebsdaten!AU15","v":0},{"$f":"Betriebsdaten!AV15","v":0},{"$f":"Betriebsdaten!AW15","v":0},{"$f":"Betriebsdaten!AX15","v":0},{"$f":"Betriebsdaten!AY15","v":0},{"$f":"Betriebsdaten!AZ15","v":0},{"$f":"Betriebsdaten!BA15","v":0},{"$f":"Betriebsdaten!BB15","v":0},{"$f":"Betriebsdaten!BC15","v":0},{"$f":"Betriebsdaten!BD15","v":0},{"$f":"Betriebsdaten!BE15","v":0},{"$f":"Betriebsdaten!BF15","v":0},{"$f":"Betriebsdaten!BG15","v":0},{"$f":"Betriebsdaten!BH15","v":0},{"$f":"Betriebsdaten!BI15","v":0},{"$f":"Betriebsdaten!BJ15","v":0}]
[null,"Sorte",{"$f":"Betriebsdaten!C16","v":"Gijnlim"},{"$f":"Betriebsdaten!D16","v":0},{"$f":"Betriebsdaten!E16","v":0},{"$f":"Betriebsdaten!F16","v":0},{"$f":"Betriebsdaten!G16","v":0},{"$f":"Betriebsdaten!H16","v":0},{"$f":"Betriebsdaten!I16","v":0},{"$f":"Betriebsdaten!J16","v":0},{"$f":"Betriebsdaten!K16","v":0},{"$f":"Betriebsdaten!L16","v":0},{"$f":"Betriebsdaten!M16","v":0},{"$f":"Betriebsdaten!N16","v":0},{"$f":"Betriebsdaten!O16","v":0},{"$f":"Betriebsdaten!P16","v":0},{"$f":"Betriebsdaten!Q16","v":0},{"$f":"Betriebsdaten!R16","v":0},{"$f":"Betriebsdaten!S16","v":0},{"$f":"Betriebsdaten!T16","v":0},{"$f":"Betriebsdaten!U16","v":0},{"$f":"Betriebsdaten!V16","v":0},{"$f":"Betriebsdaten!W16","v":0},{"$f":"Betriebsdaten!X16","v":0},{"$f":"Betriebsdaten!Y16","v":0},{"$f":"Betriebsdaten!Z16","v":0},{"$f":"Betriebsdaten!AA16","v":0},{"$f":"Betriebsdaten!AB16","v":0},{"$f":"Betriebsdaten!AC16","v":0},{"$f":"Betriebsdaten!AD16","v":0},{"$f":"Betriebsdaten!AE16","v":0},{"$f":"Betriebsdaten!AF16","v":0},{"$f":"Betriebsdaten!AG16","v":0},{"$f":"Betriebsdaten!AH16","v":0},{"$f":"Betriebsdaten!AI16","v":0},{"$f":"Betriebsdaten!AJ16","v":0},{"$f":"Betriebsdaten!AK16","v":0},{"$f":"Betriebsdaten!AL16","v":0},{"$f":"Betriebsdaten!AM16","v":0},{"$f":"Betriebsdaten!AN16","v":0},{"$f":"Betriebsdaten!AO16","v":0},{"$f":"Betriebsdaten!AP16","v":0},{"$f":"Betriebsdaten!AQ16","v":0},{"$f":"Betriebsdaten!AR16","v":0},{"$f":"Betriebsdaten!AS16","v":0},{"$f":"Betriebsdaten!AT16","v":0},{"$f":"Betriebsdaten!AU16","v":0},{"$f":"Betriebsdaten!AV16","v":0},{"$f":"Betriebsdaten!AW16","v":0},{"$f":"Betriebsdaten!AX16","v":0},{"$f":"Betriebsdaten!AY16","v":0},{"$f":"Betriebsdaten!AZ16","v":0},{"$f":"Betriebsdaten!BA16","v":0},{"$f":"Betriebsdaten!BB16","v":0},{"$f":"Betriebsdaten!BC16","v":0},{"$f":"Betriebsdaten!BD16","v":0},{"$f":"Betriebsdaten!BE16","v":0},{"$f":"Betriebsdaten!BF16","v":0},{"$f":"Betriebsdaten!BG16","v":0},{"$f":"Betriebsdaten!BH16","v":0},{"$f":"Betriebsdaten!BI16","v":0},{"$f":"Betriebsdaten!BJ16","v":0}]
[null,"ha",{"$f":"Betriebsdaten!C17","v":3.8},{"$f":"Betriebsdaten!D17","v":0},{"$f":"Betriebsdaten!E17","v":0},{"$f":"Betriebsdaten!F17","v":0},{"$f":"Betriebsdaten!G17","v":0},{"$f":"Betriebsdaten!H17","v":0},{"$f":"Betriebsdaten!I17","v":0},{"$f":"Betriebsdaten!J17","v":0},{"$f":"Betriebsdaten!K17","v":0},{"$f":"Betriebsdaten!L17","v":0},{"$f":"Betriebsdaten!M17","v":0},{"$f":"Betriebsdaten!N17","v":0},{"$f":"Betriebsdaten!O17","v":0},{"$f":"Betriebsdaten!P17","v":0},{"$f":"Betriebsdaten!Q17","v":0},{"$f":"Betriebsdaten!R17","v":0},{"$f":"Betriebsdaten!S17","v":0},{"$f":"Betriebsdaten!T17","v":0},{"$f":"Betriebsdaten!U17","v":0},{"$f":"Betriebsdaten!V17","v":0},{"$f":"Betriebsdaten!W17","v":0},{"$f":"Betriebsdaten!X17","v":0},{"$f":"Betriebsdaten!Y17","v":0},{"$f":"Betriebsdaten!Z17","v":0},{"$f":"Betriebsdaten!AA17","v":0},{"$f":"Betriebsdaten!AB17","v":0},{"$f":"Betriebsdaten!AC17","v":0},{"$f":"Betriebsdaten!AD17","v":0},{"$f":"Betriebsdaten!AE17","v":0},{"$f":"Betriebsdaten!AF17","v":0},{"$f":"Betriebsdaten!AG17","v":0},{"$f":"Betriebsdaten!AH17","v":0},{"$f":"Betriebsdaten!AI17","v":0},{"$f":"Betriebsdaten!AJ17","v":0},{"$f":"Betriebsdaten!AK17","v":0},{"$f":"Betriebsdaten!AL17","v":0},{"$f":"Betriebsdaten!AM17","v":0},{"$f":"Betriebsdaten!AN17","v":0},{"$f":"Betriebsdaten!AO17","v":0},{"$f":"Betriebsdaten!AP17","v":0},{"$f":"Betriebsdaten!AQ17","v":0},{"$f":"Betriebsdaten!AR17","v":0},{"$f":"Betriebsdaten!AS17","v":0},{"$f":"Betriebsdaten!AT17","v":0},{"$f":"Betriebsdaten!AU17","v":0},{"$f":"Betriebsdaten!AV17","v":0},{"$f":"Betriebsdaten!AW17","v":0},{"$f":"Betriebsdaten!AX17","v":0},{"$f":"Betriebsdaten!AY17","v":0},{"$f":"Betriebsdaten!AZ17","v":0},{"$f":"Betriebsdaten!BA17","v":0},{"$f":"Betriebsdaten!BB17","v":0},{"$f":"Betriebsdaten!BC17","v":0},{"$f":"Betriebsdaten!BD17","v":0},{"$f":"Betriebsdaten!BE17","v":0},{"$f":"Betriebsdaten!BF17","v":0},{"$f":"Betriebsdaten!BG17","v":0},{"$f":"Betriebsdaten!BH17","v":0},{"$f":"Betriebsdaten!BI17","v":0},{"$f":"Betriebsdaten!BJ17","v":0},{"$f":"SUM(C6:BJ6)","v":3.8}]
[null,null,null,"Lohnkosten / ha"]
[null,"Lohn Ernte",6890,null,null,null,null,null,null,null,null,null,null,null,null,null,null,null,null,null,null,null,null,null,null,null,null,null,null,null,null,null,null,null,null,null,null,null,null,null,null,null,null,null,null,null,null,null,null,null,null,null,null,null,null,null,null,null,null,null,null,null,{"$f":"(C8*$C$6)+(D8*$D$6)+(E8*$E$6)+(F8*$F$6)+(G8*$G$6)+(H8*$H$6)+(I8*$I$6)+(J8*$J$6)+(K8*$K$6)+(L8*$L$6)+(M8*$M$6)+(N8*$N$6)+(O8*$O$6)+(P8*$P$6)+(Q8*$Q$6)+(R8*$R$6)+(S8*$S$6)+(T8*$T$6)+(U8*$U$6)+(V8*$V$6)+(W8*$W$6)+(X8*$X$6)+(Y8*$Y$6)+(Z8*$Z$6)+(AA8*$AA$6)+(AB8*$AB$6)+(AC8*$AC$6)+(AD8*$AD$6)+(AE8*$AE$6)+(AF8*$AF$6)+(AG8*$AG$6)+(AH8*$AH$6)+(AI8*$AI$6)+(AJ8*$AJ$6)+(AK8*$AK$6)+(AL8*$AL$6)+(AM8*$AM$6)+(AN8*$AN$6)+(AO8*$AO$6)+(AP8*$AP$6)+(AQ8*$AQ$6)+(AR8*$AR$6)+(AS8*$AS$6)+(AT8*$AT$6)+(AU8*$AU$6)+(AV8*$AV$6)+(AW8*$AW$6)+(AX8*$AX$6)+(AY8*$AY$6)+(AZ8*$AZ$6)+(BA8*$BA$6)+(BB8*$BB$6)+(BC8*$BC$6)+(BD8*$BD$6)+(BE8*$BE$6)+(BF8*$BF$6)*(BG8*$BG$6)+(BH8*$BH$6)+(BI8*$BI$6)+(BJ8*$BJ$6)","v":26182}]
[null,"Lohn Aufbereitung",2022,null,null,null,null,null,null,null,null,null,null,null,null,null,null,null,null,null,null,null,null,null,null,null,null,null,null,null,null,null,null,null,null,null,null,null,null,null,null,null,null,null,null,null,null,null,null,null,null,null,null,null,null,null,null,null,null,null,null,null,{"$f":"(C9*$C$6)+(D9*$D$6)+(E9*$E$6)+(F9*$F$6)+(G9*$G$6)+(H9*$H$6)+(I9*$I$6)+(J9*$J$6)+(K9*$K$6)+(L9*$L$6)+(M9*$M$6)+(N9*$N$6)+(O9*$O$6)+(P9*$P$6)+(Q9*$Q$6)+(R9*$R$6)+(S9*$S$6)+(T9*$T$6)+(U9*$U$6)+(V9*$V$6)+(W9*$W$6)+(X9*$X$6)+(Y9*$Y$6)+(Z9*$Z$6)+(AA9*$AA$6)+(AB9*$AB$6)+(AC9*$AC$6)+(AD9*$AD$6)+(AE9*$AE$6)+(AF9*$AF$6)+(AG9*$AG$6)+(AH9*$AH$6)+(AI9*$AI$6)+(AJ9*$AJ$6)+(AK9*$AK$6)+(AL9*$AL$6)+(AM9*$AM$6)+(AN9*$AN$6)+(AO9*$AO$6)+(AP9*$AP$6)+(AQ9*$AQ$6)+(AR9*$AR$6)+(AS9*$AS$6)+(AT9*$AT$6)+(AU9*$AU$6)+(AV9*$AV$6)+(AW9*$AW$6)+(AX9*$AX$6)+(AY9*$AY$6)+(AZ9*$AZ$6)+(BA9*$BA$6)+(BB9*$BB$6)+(BC9*$BC$6)+(BD9*$BD$6)+(BE9*$BE$6)+(BF9*$BF$6)*(BG9*$BG$6)+(BH9*$BH$6)+(BI9*$BI$6)+(BJ9*$BJ$6)","v":7683.5999999999995}]
[null,"Lohn Feldarbeiten",890,null,null,null,null,null,null,null,null,null,null,null,null,null,null,null,null,null,null,null,null,null,null,null,null,null,null,null,null,null,null,null,null,null,null,null,null,null,null,null,null,null,null,null,null,null,null,null,null,null,null,null,null,null,null,null,null,null,null,null,3382]
[null,"Lohn Handhacke",240,null,null,null,null,null,null,null,null,null,null,null,null,null,null,null,null,null,null,null,null,null,null,null,null,null,null,null,null,null,null,null,null,null,null,null,null,null,null,null,null,null,null,null,null,null,null,null,null,null,null,null,null,null,null,null,null,null,null,null,912]
[null,"Lohn Bewässerung",120,null,null,null,null,null,null,null,null,null,null,null,null,null,null,null,null,null,null,null,null,null,null,null,null,null,null,null,null,null,null,null,null,null,null,null,null,null,null,null,null,null,null,null,null,null,null,null,null,null,null,null,null,null,null,null,null,null,null,null,456]
[null,"Lohn Vorarbeiter",400,null,null,null,null,null,null,null,null,null,null,null,null,null,null,null,null,null,null,null,null,null,null,null,null,null,null,null,null,null,null,null,null,null,null,null,null,null,null,null,null,null,null,null,null,null,null,null,null,null,null,null,null,null,null,null,null,null,null,null,1520]
[null,"Lohn Transport",130,null,null,null,null,null,null,null,null,null,null,null,null,null,null,null,null,null,null,null,null,null,null,null,null,null,null,null,null,null,null,null,null,null,null,null,null,null,null,null,null,null,null,null,null,null,null,null,null,null,null,null,null,null,null,null,null,null,null,null,494]
[null,"Sturmschaden",210,null,null,null,null,null,null,null,null,null,null,null,null,null,null,null,null,null,null,null,null,null,null,null,null,null,null,null,null,null,null,null,null,null,null,null,null,null,null,null,null,null,null,null,null,null,null,null,null,null,null,null,null,null,null,null,null,null,null,null,798]
[null,"Sozialver. Abgaben",1948,null,null,null,null,null,null,null,null,null,null,null,null,null,null,null,null,null,null,null,null,null,null,null,null,null,null,null,null,null,null,null,null,null,null,null,null,null,null,null,null,null,null,null,null,null,null,null,null,null,null,null,null,null,null,null,null,null,null,null,7402.4]
[null,"Lohn Büro",930,null,null,null,null,null,null,null,null,null,null,null,null,null,null,null,null,null,null,null,null,null,null,null,null,null,null,null,null,null,null,null,null,null,null,null,null,null,null,null,null,null,null,null,null,null,null,null,null,null,null,null,null,null,null,null,null,null,null,null,3534]
[null,null,null,null,null,null,null,null,null,null,null,null,null,null,null,null,null,null,null,null,null,null,null,null,null,null,null,null,null,null,null,null,null,null,null,null,null,null,null,null,null,null,null,null,null,null,null,null,null,null,null,null,null,null,null,null,null,null,null,null,null,null,0]
[null,null,null,null,null,null,null,null,null,null,null,null,null,null,null,null,null,null,null,null,null,null,null,null,null,null,null,null,null,null,null,null,null,null,null,null,null,null,null,null,null,null,null,null,null,null,null,null,null,null,null,null,null,null,null,null,null,null,null,null,null,null,0]
[null,null,null,null,null,null,null,null,null,null,null,null,null,null,null,null,null,null,null,null,null,null,null,null,null,null,null,null,null,null,null,null,null,null,null,null,null,null,null,null,null,null,null,null,null,null,null,null,null,null,null,null,null,null,null,null,null,null,null,null,null,null,0]
[null,null,null,null,null,null,null,null,null,null,null,null,null,null,null,null,null,null,null,null,null,null,null,null,null,null,null,null,null,null,null,null,null,null,null,null,null,null,null,null,null,null,null,null,null,null,null,null,null,null,null,null,null,null,null,null,null,null,null,null,null,null,0]
[null,null,null,null,null,null,null,null,null,null,null,null,null,null,null,null,null,null,null,null,null,null,null,null,null,null,null,null,null,null,null,null,null,null,null,null,null,null,null,null,null,null,null,null,null,null,null,null,null,null,null,null,null,null,null,null,null,null,null,null,null,null,0]
[null,null,null,null,null,null,null,null,null,null,null,null,null,null,null,null,null,null,null,null,null,null,null,null,null,null,null,null,null,null,null,null,null,null,null,null,null,null,null,null,null,null,null,null,null,null,null,null,null,null,null,null,null,null,null,null,null,null,null,null,null,null,0]
[null,null,null,null,null,null,null,null,null,null,null,null,null,null,null,null,null,null,null,null,null,null,null,null,null,null,null,null,null,null,null,null,null,null,null,null,null,null,null,null,null,null,null,null,null,null,null,null,null,null,null,null,null,null,null,null,null,null,null,null,null,null,0]
[null,null,null,null,null,null,null,null,null,null,null,null,null,null,null,null,null,null,null,null,null,null,null,null,null,null,null,null,null,null,null,null,null,null,null,null,null,null,null,null,null,null,null,null,null,null,null,null,null,null,null,null,null,null,null,null,null,null,null,null,null,null,0]
[null,null,null,null,null,null,null,null,null,null,null,null,null,null,null,null,null,null,null,null,null,null,null,null,null,null,null,null,null,null,null,null,null,null,null,null,null,null,null,null,null,null,null,null,null,null,null,null,null,null,null,null,null,null,null,null,null,null,null,null,null,null,0]
[null,null,null,null,null,null,null,null,null,null,null,null,null,null,null,null,null,null,null,null,null,null,null,null,null,null,null,null,null,null,null,null,null,null,null,null,null,null,null,null,null,null,null,null,null,null,null,null,null,null,null,null,null,null,null,null,null,null,null,null,null,null,0]
[null,"Lohnkosten /ha",{"$f":"SUM(C8:C27)","v":13780},0,0,0,0,0,0,0,0,0,0,0,0,0,0,0,0,0,0,0,{"$f":"SUM(W8:W27)","v":0},0,0,0,0,0,0,0,0,0,{"$f":"SUM(AG8:AG27)","v":0},0,0,0,0,0,0,0,0,0,0,0,0,0,0,0,0,0,0,0,0,0,0,0,0,0,0,0,0,0]
[null,"L-kosten gesamt",{"$f":"C28*C6","v":52364},0,0,0,0,0,0,0,0,0,0,0,0,0,0,0,0,0,0,0,{"$f":"W28*W6","v":0},0,0,0,0,0,0,0,0,0,{"$f":"AG28*AG6","v":0},0,0,0,0,0,0,0,0,0,0,0,0,0,0,0,0,0,0,0,0,0,0,0,0,0,0,0,0,0,{"$f":"SUM(C29:BJ29)","v":52364}]
[null,null,null,"Materialkosten / ha"]
[null,"Zaun anteilig",150,null,null,null,null,null,null,null,null,null,null,null,null,null,null,null,null,null,null,null,null,null,null,null,null,null,null,null,null,null,null,null,null,null,null,null,null,null,null,null,null,null,null,null,null,null,null,null,null,null,null,null,null,null,null,null,null,null,null,null,{"$f":"(C31*$C$6)+(D31*$D$6)+(E31*$E$6)+(F31*$F$6)+(G31*$G$6)+(H31*$H$6)+(I31*$I$6)+(J31*$J$6)+(K31*$K$6)+(L31*$L$6)+(M31*$M$6)+(N31*$N$6)+(O31*$O$6)+(P31*$P$6)+(Q31*$Q$6)+(R31*$R$6)+(S31*$S$6)+(T31*$T$6)+(U31*$U$6)+(V31*$V$6)+(W31*$W$6)+(X31*$X$6)+(Y31*$Y$6)+(Z31*$Z$6)+(AA31*$AA$6)+(AB31*$AB$6)+(AC31*$AC$6)+(AD31*$AD$6)+(AE31*$AE$6)+(AF31*$AF$6)+(AG31*$AG$6)+(AH31*$AH$6)+(AI31*$AI$6)+(AJ31*$AJ$6)+(AK31*$AK$6)+(AL31*$AL$6)+(AM31*$AM$6)+(AN31*$AN$6)+(AO31*$AO$6)+(AP31*$AP$6)+(AQ31*$AQ$6)+(AR31*$AR$6)+(AS31*$AS$6)+(AT31*$AT$6)+(AU31*$AU$6)+(AV31*$AV$6)+(AW31*$AW$6)+(AX31*$AX$6)+(AY31*$AY$6)+(AZ31*$AZ$6)+(BA31*$BA$6)+(BB31*$BB$6)+(BC31*$BC$6)+(BD31*$BD$6)+(BE31*$BE$6)+(BF31*$BF$6)*(BG31*$BG$6)+(BH31*$BH$6)+(BI31*$BI$6)+(BJ31*$BJ$6)","v":570}]
[null,"Folie s/w",411,null,null,null,null,null,null,null,null,null,null,null,null,null,null,null,null,null,null,null,null,null,null,null,null,null,null,null,null,null,null,null,null,null,null,null,null,null,null,null,null,null,null,null,null,null,null,null,null,null,null,null,null,null,null,null,null,null,null,null,1561.8]
[null,"Folie T+",650.01,null,null,null,null,null,null,null,null,null,null,null,null,null,null,null,null,null,null,null,null,null,null,null,null,null,null,null,null,null,null,null,null,null,null,null,null,null,null,null,null,null,null,null,null,null,null,null,null,null,null,null,null,null,null,null,null,null,null,null,2470.038]
[null,"Folie 3fach",null,null,null,null,null,null,null,null,null,null,null,null,null,null,null,null,null,null,null,null,null,null,null,null,null,null,null,null,null,null,null,null,null,null,null,null,null,null,null,null,null,null,null,null,null,null,null,null,null,null,null,null,null,null,null,null,null,null,null,null,0]
[null,"Stechmesser",80,null,null,null,null,null,null,null,null,null,null,null,null,null,null,null,null,null,null,null,null,null,null,null,null,null,null,null,null,null,null,null,null,null,null,null,null,null,null,null,null,null,null,null,null,null,null,null,null,null,null,null,null,null,null,null,null,null,null,null,304]
[null,"Körbe",20,null,null,null,null,null,null,null,null,null,null,null,null,null,null,null,null,null,null,null,null,null,null,null,null,null,null,null,null,null,null,null,null,null,null,null,null,null,null,null,null,null,null,null,null,null,null,null,null,null,null,null,null,null,null,null,null,null,null,null,76]
[null,"Bewässerung",320,null,null,null,null,null,null,null,null,null,null,null,null,null,null,null,null,null,null,null,null,null,null,null,null,null,null,null,null,null,null,null,null,null,null,null,null,null,null,null,null,null,null,null,null,null,null,null,null,null,null,null,null,null,null,null,null,null,null,null,1216]
[null,"Stirnpfähle",55,null,null,null,null,null,null,null,null,null,null,null,null,null,null,null,null,null,null,null,null,null,null,null,null,null,null,null,null,null,null,null,null,null,null,null,null,null,null,null,null,null,null,null,null,null,null,null,null,null,null,null,null,null,null,null,null,null,null,null,209]
[null,null,null,null,null,null,null,null,null,null,null,null,null,null,null,null,null,null,null,null,null,null,null,null,null,null,null,null,null,null,null,null,null,null,null,null,null,null,null,null,null,null,null,null,null,null,null,null,null,null,null,null,null,null,null,null,null,null,null,null,null,null,0]
[null,null,null,null,null,null,null,null,null,null,null,null,null,null,null,null,null,null,null,null,null,null,null,null,null,null,null,null,null,null,null,null,null,null,null,null,null,null,null,null,null,null,null,null,null,null,null,null,null,null,null,null,null,null,null,null,null,null,null,null,null,null,0]
[null,null,null,null,null,null,null,null,null,null,null,null,null,null,null,null,null,null,null,null,null,null,null,null,null,null,null,null,null,null,null,null,null,null,null,null,null,null,null,null,null,null,null,null,null,null,null,null,null,null,null,null,null,null,null,null,null,null,null,null,null,null,0]
[null,null,null,null,null,null,null,null,null,null,null,null,null,null,null,null,null,null,null,null,null,null,null,null,null,null,null,null,null,null,null,null,null,null,null,null,null,null,null,null,null,null,null,null,null,null,null,null,null,null,null,null,null,null,null,null,null,null,null,null,null,null,0]
[null,null,null,null,null,null,null,null,null,null,null,null,null,null,null,null,null,null,null,null,null,null,null,null,null,null,null,null,null,null,null,null,null,null,null,null,null,null,null,null,null,null,null,null,null,null,null,null,null,null,null,null,null,null,null,null,null,null,null,null,null,null,0]
[null,null,null,null,null,null,null,null,null,null,null,null,null,null,null,null,null,null,null,null,null,null,null,null,null,null,null,null,null,null,null,null,null,null,null,null,null,null,null,null,null,null,null,null,null,null,null,null,null,null,null,null,null,null,null,null,null,null,null,null,null,null,0]
[null,null,null,null,null,null,null,null,null,null,null,null,null,null,null,null,null,null,null,null,null,null,null,null,null,null,null,null,null,null,null,null,null,null,null,null,null,null,null,null,null,null,null,null,null,null,null,null,null,null,null,null,null,null,null,null,null,null,null,null,null,null,0]
[null,null,null,null,null,null,null,null,null,null,null,null,null,null,null,null,null,null,null,null,null,null,null,null,null,null,null,null,null,null,null,null,null,null,null,null,null,null,null,null,null,null,null,null,null,null,null,null,null,null,null,null,null,null,null,null,null,null,null,null,null,null,0]
[null,null,null,null,null,null,null,null,null,null,null,null,null,null,null,null,null,null,null,null,null,null,null,null,null,null,null,null,null,null,null,null,null,null,null,null,null,null,null,null,null,null,null,null,null,null,null,null,null,null,null,null,null,null,null,null,null,null,null,null,null,null,0]
[null,null,null,null,null,null,null,null,null,null,null,null,null,null,null,null,null,null,null,null,null,null,null,null,null,null,null,null,null,null,null,null,null,null,null,null,null,null,null,null,null,null,null,null,null,null,null,null,null,null,null,null,null,null,null,null,null,null,null,null,null,null,0]
[null,null,null,null,null,null,null,null,null,null,null,null,null,null,null,null,null,null,null,null,null,null,null,null,null,null,null,null,null,null,null,null,null,null,null,null,null,null,null,null,null,null,null,null,null,null,null,null,null,null,null,null,null,null,null,null,null,null,null,null,null,null,0]
[null,null,null,null,null,null,null,null,null,null,null,null,null,null,null,null,null,null,null,null,null,null,null,null,null,null,null,null,null,null,null,null,null,null,null,null,null,null,null,null,null,null,null,null,null,null,null,null,null,null,null,null,null,null,null,null,null,null,null,null,null,null,0]
[null,null,null,null,null,null,null,null,null,null,null,null,null,null,null,null,null,null,null,null,null,null,null,null,null,null,null,null,null,null,null,null,null,null,null,null,null,null,null,null,null,null,null,null,null,null,null,null,null,null,null,null,null,null,null,null,null,null,null,null,null,null,0]
[null,null,null,null,null,null,null,null,null,null,null,null,null,null,null,null,null,null,null,null,null,null,null,null,null,null,null,null,null,null,null,null,null,null,null,null,null,null,null,null,null,null,null,null,null,null,null,null,null,null,null,null,null,null,null,null,null,null,null,null,null,null,0]
[null,null,null,null,null,null,null,null,null,null,null,null,null,null,null,null,null,null,null,null,null,null,null,null,null,null,null,null,null,null,null,null,null,null,null,null,null,null,null,null,null,null,null,null,null,null,null,null,null,null,null,null,null,null,null,null,null,null,null,null,null,null,0]
[null,null,null,null,null,null,null,null,null,null,null,null,null,null,null,null,null,null,null,null,null,null,null,null,null,null,null,null,null,null,null,null,null,null,null,null,null,null,null,null,null,null,null,null,null,null,null,null,null,null,null,null,null,null,null,null,null,null,null,null,null,null,0]
[null,"Kosten Material / ha",{"$f":"SUM(C31:C54)","v":1686.01},0,0,0,0,0,0,0,0,0,0,0,0,0,0,0,0,0,0,0,{"$f":"SUM(W31:W54)","v":0},0,0,0,0,0,0,0,0,0,{"$f":"SUM(AG31:AG54)","v":0},0,0,0,0,0,0,0,0,0,0,0,0,0,0,0,0,0,0,0,0,0,0,0,0,0,0,0,0,0]
[null,"Kosten Material gesamt",{"$f":"C55*C6","v":6406.8379999999997},0,0,0,0,0,0,0,0,0,0,0,0,0,0,0,0,0,0,0,{"$f":"W55*W6","v":0},0,0,0,0,0,0,0,0,0,{"$f":"AG55*AG6","v":0},0,0,0,0,0,0,0,0,0,0,0,0,0,0,0,0,0,0,0,0,0,0,0,0,0,0,0,0,0,{"$f":"SUM(C56:BJ56)","v":6406.8379999999997}]
[]
[null,null,null,"sonstige Kosten / ha"]
[null,"Pacht",1350,null,null,null,null,null,null,null,null,null,null,null,null,null,null,null,null,null,null,null,null,null,null,null,null,null,null,null,null,null,null,null,null,null,null,null,null,null,null,null,null,null,null,null,null,null,null,null,null,null,null,null,null,null,null,null,null,null,null,null,{"$f":"(C59*$C$6)+(D59*$D$6)+(E59*$E$6)+(F59*$F$6)+(G59*$G$6)+(H59*$H$6)+(I59*$I$6)+(J59*$J$6)+(K59*$K$6)+(L59*$L$6)+(M59*$M$6)+(N59*$N$6)+(O59*$O$6)+(P59*$P$6)+(Q59*$Q$6)+(R59*$R$6)+(S59*$S$6)+(T59*$T$6)+(U59*$U$6)+(V59*$V$6)+(W59*$W$6)+(X59*$X$6)+(Y59*$Y$6)+(Z59*$Z$6)+(AA59*$AA$6)+(AB59*$AB$6)+(AC59*$AC$6)+(AD59*$AD$6)+(AE59*$AE$6)+(AF59*$AF$6)+(AG59*$AG$6)+(AH59*$AH$6)+(AI59*$AI$6)+(AJ59*$AJ$6)+(AK59*$AK$6)+(AL59*$AL$6)+(AM59*$AM$6)+(AN59*$AN$6)+(AO59*$AO$6)+(AP59*$AP$6)+(AQ59*$AQ$6)+(AR59*$AR$6)+(AS59*$AS$6)+(AT59*$AT$6)+(AU59*$AU$6)+(AV59*$AV$6)+(AW59*$AW$6)+(AX59*$AX$6)+(AY59*$AY$6)+(AZ59*$AZ$6)+(BA59*$BA$6)+(BB59*$BB$6)+(BC59*$BC$6)+(BD59*$BD$6)+(BE59*$BE$6)+(BF59*$BF$6)*(BG59*$BG$6)+(BH59*$BH$6)+(BI59*$BI$6)+(BJ59*$BJ$6)","v":5130}]
[null,"Berufsgenossen.",108,null,null,null,null,null,null,null,null,null,null,null,null,null,null,null,null,null,null,null,null,null,null,null,null,null,null,null,null,null,null,null,null,null,null,null,null,null,null,null,null,null,null,null,null,null,null,null,null,null,null,null,null,null,null,null,null,null,null,null,410.4]
[null,"Vermarktungsgeb.",null,null,null,null,null,null,null,null,null,null,null,null,null,null,null,null,null,null,null,null,null,null,null,null,null,null,null,null,null,null,null,null,null,null,null,null,null,null,null,null,null,null,null,null,null,null,null,null,null,null,null,null,null,null,null,null,null,null,null,null,0]
[null,"Hagelversicherung",220,null,null,null,null,null,null,null,null,null,null,null,null,null,null,null,null,null,null,null,null,null,null,null,null,null,null,null,null,null,null,null,null,null,null,null,null,null,null,null,null,null,null,null,null,null,null,null,null,null,null,null,null,null,null,null,null,null,null,null,836]
[null,"Vermittlungsgeb.",null,null,null,null,null,null,null,null,null,null,null,null,null,null,null,null,null,null,null,null,null,null,null,null,null,null,null,null,null,null,null,null,null,null,null,null,null,null,null,null,null,null,null,null,null,null,null,null,null,null,null,null,null,null,null,null,null,null,null,null,0]
[null,"Vorbereitungsjahr",220,null,null,null,null,null,null,null,null,null,null,null,null,null,null,null,null,null,null,null,null,null,null,null,null,null,null,null,null,null,null,null,null,null,null,null,null,null,null,null,null,null,null,null,null,null,null,null,null,null,null,null,null,null,null,null,null,null,null,null,836]
[null,"Wasserentnahme",80,null,null,null,null,null,null,null,null,null,null,null,null,null,null,null,null,null,null,null,null,null,null,null,null,null,null,null,null,null,null,null,null,null,null,null,null,null,null,null,null,null,null,null,null,null,null,null,null,null,null,null,null,null,null,null,null,null,null,null,304]
[null,"Bürokosten",860,null,null,null,null,null,null,null,null,null,null,null,null,null,null,null,null,null,null,null,null,null,null,null,null,null,null,null,null,null,null,null,null,null,null,null,null,null,null,null,null,null,null,null,null,null,null,null,null,null,null,null,null,null,null,null,null,null,null,null,3268]
[null,"Werbung",350,null,null,null,null,null,null,null,null,null,null,null,null,null,null,null,null,null,null,null,null,null,null,null,null,null,null,null,null,null,null,null,null,null,null,null,null,null,null,null,null,null,null,null,null,null,null,null,null,null,null,null,null,null,null,null,null,null,null,null,1330]
[null,"Strom",180,null,null,null,null,null,null,null,null,null,null,null,null,null,null,null,null,null,null,null,null,null,null,null,null,null,null,null,null,null,null,null,null,null,null,null,null,null,null,null,null,null,null,null,null,null,null,null,null,null,null,null,null,null,null,null,null,null,null,null,684]
[null,"Beratung",100,null,null,null,null,null,null,null,null,null,null,null,null,null,null,null,null,null,null,null,null,null,null,null,null,null,null,null,null,null,null,null,null,null,null,null,null,null,null,null,null,null,null,null,null,null,null,null,null,null,null,null,null,null,null,null,null,null,null,null,380]
[null,null,null,null,null,null,null,null,null,null,null,null,null,null,null,null,null,null,null,null,null,null,null,null,null,null,null,null,null,null,null,null,null,null,null,null,null,null,null,null,null,null,null,null,null,null,null,null,null,null,null,null,null,null,null,null,null,null,null,null,null,null,{"$f":"(C70*$C$6)+(D70*$D$6)+(E70*$E$6)+(F70*$F$6)+(G70*$G$6)+(H70*$H$6)+(I70*$I$6)+(J70*$J$6)+(K70*$K$6)+(L70*$L$6)+(M70*$M$6)+(N70*$N$6)+(O70*$O$6)+(P70*$P$6)+(Q70*$Q$6)+(R70*$R$6)+(S70*$S$6)+(T70*$T$6)+(U70*$U$6)+(V70*$V$6)+(W70*$W$6)+(X70*$X$6)+(Y70*$Y$6)+(Z70*$Z$6)+(AA70*$AA$6)+(AB70*$AB$6)+(AC70*$AC$6)+(AD70*$AD$6)+(AE70*$AE$6)+(AF70*$AF$6)+(AG70*$AG$6)+(AH70*$AH$6)+(AI70*$AI$6)+(AJ70*$AJ$6)+(AK70*$AK$6)+(AL70*$AL$6)+(AM70*$AM$6)+(AN70*$AN$6)+(AO70*$AO$6)+(AP70*$AP$6)+(AQ70*$AQ$6)+(AR70*$AR$6)+(AS70*$AS$6)+(AT70*$AT$6)+(AU70*$AU$6)+(AV70*$AV$6)+(AW70*$AW$6)+(AX70*$AX$6)+(AY70*$AY$6)+(AZ70*$AZ$6)+(BA70*$BA$6)+(BB70*$BB$6)+(BC70*$BC$6)+(BD70*$BD$6)+(BE70*$BE$6)+(BF70*$BF$6)*(BG70*$BG$6)+(BH70*$BH$6)+(BI70*$BI$6)+(BJ70*$BJ$6)","v":0}]
[null,null,null,null,null,null,null,null,null,null,null,null,null,null,null,null,null,null,null,null,null,null,null,null,null,null,null,null,null,null,null,null,null,null,null,null,null,null,null,null,null,null,null,null,null,null,null,null,null,null,null,null,null,null,null,null,null,null,null,null,null,null,0]
[null,null,null,null,null,null,null,null,null,null,null,null,null,null,null,null,null,null,null,null,null,null,null,null,null,null,null,null,null,null,null,null,null,null,null,null,null,null,null,null,null,null,null,null,null,null,null,null,null,null,null,null,null,null,null,null,null,null,null,null,null,null,0]
[null,null,null,null,null,null,null,null,null,null,null,null,null,null,null,null,null,null,null,null,null,null,null,null,null,null,null,null,null,null,null,null,null,null,null,null,null,null,null,null,null,null,null,null,null,null,null,null,null,null,null,null,null,null,null,null,null,null,null,null,null,null,0]
[null,null,null,null,null,null,null,null,null,null,null,null,null,null,null,null,null,null,null,null,null,null,null,null,null,null,null,null,null,null,null,null,null,null,null,null,null,null,null,null,null,null,null,null,null,null,null,null,null,null,null,null,null,null,null,null,null,null,null,null,null,null,0]
[null,null,null,null,null,null,null,null,null,null,null,null,null,null,null,null,null,null,null,null,null,null,null,null,null,null,null,null,null,null,null,null,null,null,null,null,null,null,null,null,null,null,null,null,null,null,null,null,null,null,null,null,null,null,null,null,null,null,null,null,null,null,0]
[null,"sonstige Kosten ha",{"$f":"SUM(C59:C75)","v":3468},{"$f":"SUM(D59:D75)","v":0},0,0,0,0,0,0,0,0,0,0,0,0,0,0,0,0,0,0,0,0,0,0,0,0,0,0,0,0,{"$f":"SUM(AG59:AG75)","v":0},0,0,0,0,0,0,0,0,0,0,0,0,0,0,0,0,0,0,0,0,0,0,0,0,0,0,0,0,0]
[null,"sonstige Kosten gesamt",{"$f":"C76*C6","v":13178.4},0,0,0,0,0,0,0,0,0,0,0,0,0,0,0,0,0,0,0,0,0,0,0,0,0,0,0,0,{"$f":"AF76*AF6","v":0},{"$f":"AG76*AG6","v":0},0,0,0,0,0,0,0,0,0,0,0,0,0,0,0,0,0,0,0,0,0,0,0,0,0,0,0,0,0,{"$f":"SUM(C77:BJ77)","v":13178.4}]
[]
[]
[null,"Kosten Lohn und Material / ha",{"$f":"C28+C55","v":15466.01},0,0,0,0,0,0,0,0,0,0,0,0,0,0,0,0,0,0,0,{"$f":"W28+W55","v":0},0,0,0,0,0,0,0,0,0,{"$f":"AG28+AG55","v":0},0,0,0,0,0,0,0,0,0,0,0,0,0,0,0,0,0,0,0,0,0,0,0,0,0,0,0,0,0]
[null,"Kosten Lohn und Material gesamt",{"$f":"C29+C56","v":58770.838000000003},0,0,0,0,0,0,0,0,0,0,0,0,0,0,0,0,0,0,0,{"$f":"W29+W56","v":0},0,0,0,0,0,0,0,0,0,{"$f":"AG29+AG56","v":0},0,0,0,0,0,0,0,0,0,0,0,0,0,0,0,0,0,0,0,0,0,0,0,0,0,0,0,0,0,{"$f":"SUM(C81:BJ81)","v":58770.838000000003}]

{"sheet":"Berechnungen","index":6,"n_rows":92,"n_cols":63,"rows_kept":92,"cut":false,"hidden":false,"merged":[[2,3,2,6],[9,27,9,40],[2,1,2,2],[4,3,4,6],[6,3,6,6]]}
[]
[null,null,null,null,null,null,"Verkaufstage",{"$f":"H9+H23+H37+H51+H65+H79","v":68}]
[null,"Hofladen",null,"berechneter Durchschnittspreis",null,null,null,{"$f":"I3/H2","v":4.9141593135512558},{"$f":"SUM(I9:I91)","v":334.16283332148538}]
[]
[null,null,null,{"$f":"\"Verkaufsmenge \" &B3 & \" gesamt\"","v":"Verkaufsmenge Hofladen gesamt"},null,null,null,{"$f":"B21+B35+B49+B63+B77+B91","v":18558}]
[]
[null,null,null,{"$f":"\" Verkaufsmenge \"&B3&\" täglich\"","v":" Verkaufsmenge Hofladen täglich"},null,null,null,{"$f":"H5/H2","v":272.91176470588238},null,null,null,null,null,null,null,"Pflanzgutkosten",null,null,null,null,null,null,null,null,null,null,"Berechnung Nettoertrag",null,null,null,null,null,null,null,null,null,null,null,null,null,null,null,null,null,null,null,null,null,null,null,null,null,null,null,"Berechnung Materialkosten/Jahr"]
[]
[null,null,null,"Datum vom","2009-04-15","bis","2009-04-22",{"$f":"G9-E9","v":7},{"$f":"IF(G21<>\"\",(G21*H9),0)","v":51.836492890995267},null,null,null,null,null,null,null,null,null,null,null,null,null,null,null,null,null,"Abfall in %",22,23,24,25,26,27,28,29,30,31,32,33,34,35]
[null,"kg","% errechnet","ca. % ","Klassen","Preis 1","€/kg",null,null,null,null,null,null,null,null,null,null,5,6,7,8,9,null,null,null,null,"Ertrag","Abfall in kg",null,null,null,null,null,null,null,null,null,null,null,null,null,null,null,null,null,null,null,null,null,null,null,null,null,null,null,"Art","Investitions-","Alter","Afa","Zins","Reparatur","var.Kosten","Summe"]
[null,325,{"$f":"IF(B11>1,(B11/$B$21*100),\"\")","v":30.805687203791472},null,"Klasse 1",9,{"$f":"IF(C11<>\"\",(F11*(C11/100)),F11*(D11/100))","v":2.7725118483412325},null,null,null,null,null,null,null,null,"Pflanzen/ha",18000,null,null,null,null,null,null,null,null,null,12000,{"$f":"$AA$11-($AA$11*AB9/100)","v":9360},9240,9120,9000,8880,8760,8640,8520,8400,8280,8160,8040,7920,7800,null,null,null,null,null,null,null,null,null,null,null,null,null,null,null,"kosten",null,"%","%","%","€/Jahr","€"]
[null,280,{"$f":"IF(B12>1,(B12/$B$21*100),\"\")","v":26.540284360189574},null,"Klasse 1 vio",7.5,{"$f":"IF(C12<>\"\",(F12*(C12/100)),F12*(D12/100))","v":1.9905213270142181},null,null,null,null,null,null,null,null,"€/Pflanze",{"$f":"S12/100","v":0.37},null,37,null,null,null,null,null,null,null,11000,{"$f":"$AA12-($AA12*AB$9/100)","v":8580},8470,8360,8250,8140,8030,7920,7810,7700,7590,7480,7370,7260,7150,null,null,null,null,null,null,null,null,null,null,null,null,null,"1.","S/W Folie",1600,1,25,5,null,null,{"$f":"IF(BD12=\"\",\"\",IF(BF12=\"\",BJ12,(IF((BF12<=(100/BG12)),((BE12/2*(BH12/100)+BE12*(BG12/100)+BE12*(BI12/100)+BJ12)),BE12*BI12/100))))","v":440}]
[null,240,22.748815165876778,null,"Klasse 2",7,1.5924170616113744,null,null,null,null,null,null,null,null,"Pflanzgutkosten/ha",{"$f":"Q11*Q12","v":6660},{"$f":"$Q$13/R10","v":1332},{"$f":"$Q$13/S10","v":1110},{"$f":"$Q$13/T10","v":951.42857142857144},{"$f":"$Q$13/U10","v":832.5},{"$f":"$Q$13/V10","v":740},null,null,null,null,10000,7800,7700,7600,7500,7400,7300,7200,7100,7000,6900,6800,6700,6600,6500,null,null,null,null,null,null,null,null,null,null,null,null,null,"2.","Thermo Extrabreit",1260,1,25,5,null,null,346.5]
[null,120,11.374407582938389,null,"Klasse 2 vio",6.5,0.73933649289099534,null,null,null,null,null,null,null,null,null,null,null,null,null,null,null,null,null,null,null,9000,7020,6930,6840,6750,6660,6570,6480,6390,6300,6210,6120,6030,5940,5850,null,null,null,null,null,null,null,null,null,null,null,null,null,"3.","Erbeerfolie",1200,1,25,5,null,null,330]
[null,25,2.3696682464454977,null,"Suppe",3,7.1090047393364941E-2,null,null,null,null,null,null,null,null,"Pflanzen/ha",20000,null,null,null,null,null,null,null,null,null,8000,6240,6160,6080,6000,5920,5840,5760,5680,5600,5520,5440,5360,5280,5200,null,null,null,null,null,null,null,null,null,null,null,null,null,"4.","Tunnelstäbe",1400,1,10,5,null,null,175]
[null,45,4.2654028436018958,null,"Bruch",2.5,0.1066350710900474,null,null,null,null,null,null,null,null,"€/Pflanze",0.25,null,null,null,null,null,null,null,null,null,7500,5850,5775,5700,5625,5550,5475,5400,5325,5250,5175,5100,5025,4950,4875,null,null,null,null,null,null,null,null,null,null,null,null,null,"5.","Messer",45,1,100,5,null,null,46.125]
[null,20,1.8957345971563981,null,"Spitzen",7,0.13270142180094788,null,null,null,null,null,null,null,null,"Pflanzgutkosten/ha",{"$f":"Q15*Q16","v":5000},{"$f":"$Q$17/R10","v":1000},{"$f":"$Q$17/S10","v":833.33333333333337},{"$f":"$Q$17/T10","v":714.28571428571433},{"$f":"$Q$17/U10","v":625},{"$f":"$Q$17/V10","v":555.55555555555554},null,null,null,null,7000,5460,5390,5320,5250,5180,5110,5040,4970,4900,4830,4760,4690,4620,4550,null,null,null,null,null,null,null,null,null,null,null,null,null,"6.","Erntehilfe",3000,1,20,5,3,80,845]
[null,null,"",null,null,null,0,null,null,null,null,null,null,null,null,null,null,null,null,null,null,null,null,null,null,null,6500,5070,5005,4940,4875,4810,4745,4680,4615,4550,4485,4420,4355,4290,4225,null,null,null,null,null,null,null,null,null,null,null,null,null,"7.",null,null,1,10,5,null,null,""]
[null,null,"",null,null,null,0,null,null,null,null,null,null,null,null,"Pflanzen/ha",22000,null,null,null,null,null,null,null,null,null,6000,4680,4620,4560,4500,4440,4380,4320,4260,4200,4140,4080,4020,3960,3900,null,null,null,null,null,null,null,null,null,null,null,null,null,"8.",null,null,null,null,null,null,null,""]
[null,null,"",null,null,null,0,null,null,null,null,null,null,null,null,"€/Pflanze",0.25,null,null,null,null,null,null,null,null,null,5500,4290,4235,4180,4125,4070,4015,3960,3905,3850,3795,3740,3685,3630,3575,null,null,null,null,null,null,null,null,null,null,null,null,null,"9.",null,null,null,null,null,null,null,""]
[null,{"$f":"SUM(B11:B20)","v":1055},null,{"$f":"SUM(D11:D20)","v":0},null,null,{"$f":"IF(SUM(G11:G20)=0,\"\",(SUM(G11:G20)))","v":7.4052132701421813},null,null,null,null,null,null,null,null,"Pflanzgutkosten/ha",{"$f":"Q19*Q20","v":5500},{"$f":"$Q$21/R10","v":1100},{"$f":"$Q$21/S10","v":916.66666666666663},{"$f":"$Q$21/T10","v":785.71428571428567},{"$f":"$Q$21/U10","v":687.5},{"$f":"$Q$21/V10","v":611.11111111111109},null,null,null,null,5000,3900,3850,3800,3750,3700,3650,3600,3550,3500,3450,3400,3350,3300,3250,null,null,null,null,null,null,null,null,null,null,null,null,null,"10.",null,null,null,null,null,null,null,""]
[null,{"$f":"B21/H9","v":150.71428571428572},null,null,null,null,null,null,null,null,null,null,null,null,null,null,null,null,null,null,null,null,null,null,null,null,4500,{"$f":"$AA22-($AA22*AB$9/100)","v":3510},3465,3420,3375,3330,3285,3240,3195,3150,3105,3060,3015,2970,2925,null,null,null,null,null,null,null,null,null,null,null,null,null,"11.",null,null,null,null,null,null,null,""]
[null,null,null,"Datum vom",{"$f":"G9+1","v":"2009-04-23"},"bis","2009-05-07",{"$f":"G23-E23","v":14},{"$f":"IF(G35<>\"\",(G35*H23),0)","v":88.255681818181827},null,null,null,null,null,null,"Pflanzen/ha",20000,null,null,null,null,null,null,null,null,null,4000,3120,3080,3040,3000,2960,2920,2880,2840,2800,2760,2720,2680,2640,2600,null,null,null,null,null,null,null,null,null,null,null,null,null,"12.",null,null,null,null,null,null,null,""]
[null,"kg","% errechnet","ca. % ","Klassen","Preis 1","€/kg",null,null,null,null,null,null,null,null,"€/Pflanze",0.51,null,null,null,null,null,null,null,null,null,3500,2730,2695,2660,2625,2590,2555,2520,2485,2450,2415,2380,2345,2310,2275,null,null,null,null,null,null,null,null,null,null,null,null,null,"13.",null,null,null,null,null,null,null,""]
[null,1100,{"$f":"IF(B25>1,(B25/$B$35*100),\"\")","v":41.666666666666671},null,"Klasse 1",7,{"$f":"IF(C25<>\"\",(F25*(C25/100)),F25*(D25/100))","v":2.916666666666667},null,null,null,null,null,null,null,null,"Pflanzgutkosten/ha",{"$f":"Q23*Q24","v":10200},{"$f":"$Q$25/R10","v":2040},{"$f":"$Q$25/S10","v":1700},{"$f":"$Q$25/T10","v":1457.1428571428571},{"$f":"$Q$25/U10","v":1275},{"$f":"$Q$25/V10","v":1133.3333333333333},null,null,null,null,3000,2340,2310,2280,2250,2220,2190,2160,2130,2100,2070,2040,2010,1980,1950,null,null,null,null,null,null,null,null,null,null,null,null,null,"14.",null,null,null,null,null,null,null,""]
[null,680,{"$f":"IF(B26>1,(B26/$B$35*100),\"\")","v":25.757575757575758},null,"Klasse 1 vio",6.5,{"$f":"IF(C26<>\"\",(F26*(C26/100)),F26*(D26/100))","v":1.6742424242424243},null,null,null,null,null,null,null,null,null,null,null,null,null,null,null,null,null,null,null,2500,1950,1925,1900,1875,1850,1825,1800,1775,1750,1725,1700,1675,1650,1625,null,null,null,null,null,null,null,null,null,null,null,null,null,null,null,null,null,null,null,null,null,{"$f":"SUM(BK12:BK25)","v":2182.625}]
[null,600,22.727272727272727,null,"Klasse 2",6,1.3636363636363635,null,null,null,null,null,null,null,null,null,null,null,null,null,null,null,null,null,null,null,2000,1560,1540,1520,1500,1480,1460,1440,1420,1400,1380,1360,1340,1320,1300]
[null,110,4.1666666666666661,null,"Klasse 2 vio",4,0.16666666666666663,null,null,null,null,null,null,null,null,null,null,null,null,null,null,null,null,null,null,null,1500,1170,1155,1140,1125,1110,1095,1080,1065,1050,1035,1020,1005,990,975]
[null,65,2.4621212121212119,null,"Suppe",3,7.3863636363636354E-2,null,null,null,null,null,null,null,null,null,null,null,null,null,null,null,null,null,null,null,1000,780,770,760,750,740,730,720,710,700,690,680,670,660,650]
[null,55,2.083333333333333,null,"Bruch",2.5,5.2083333333333322E-2,null,null,null,null,null,null,null,null,null,null,null,null,null,null,null,null,null,null,null,"individuell"]
[null,30,1.1363636363636365,null,"Spitzen",5,5.6818181818181823E-2,null,null,null,null,null,null,null,null,null,null,null,null,null,null,null,null,null,null,null,4850,{"$f":"$AA31-($AA31*AB$9/100)","v":3783},3734.5,3686,3637.5,3589,3540.5,3492,3443.5,3395,3346.5,3298,3249.5,3201,3152.5]
[null,null,"",null,null,null,0,null,null,null,null,null,null,null,null,null,null,null,null,null,null,null,null,null,null,null,6980,5444.4,5374.6,5304.8,5235,5165.2,5095.3999999999996,5025.6000000000004,4955.8,4886,4816.2,4746.3999999999996,4676.6000000000004,4606.8,4537]
[null,null,"",null,null,null,0,null,null,null,null,null,null,null,null,null,null,null,null,null,null,null,null,null,null,null,10140,7909.2,7807.8,7706.4,7605,7503.6,7402.2,7300.8,7199.4,7098,6996.6,6895.2,6793.8,6692.4,6591]
[null,null,"",null,null,null,0]
[null,{"$f":"SUM(B25:B34)","v":2640},null,{"$f":"SUM(D25:D34)","v":0},null,null,{"$f":"IF(SUM(G25:G34)=0,\"\",(SUM(G25:G34)))","v":6.3039772727272734},null,null,null,null,null,null,null,null,null,null,null,null,null,null,null,null,null,null,null,"individuell",40,41,42,51.5,18]
[null,{"$f":"B35/H23","v":188.57142857142858},null,null,null,null,null,null,null,null,null,null,null,null,null,null,null,null,null,null,null,null,null,null,null,null,9800,{"$f":"$AA36-($AA36*AB$35/100)","v":5880},{"$f":"$AA36-($AA36*AC$35/100)","v":5782},5684,4753,8036,9800,9800,9800,9800,9800,9800,9800,9800,9800]
[null,null,null,"Datum vom",{"$f":"G23+1","v":"2009-05-08"},"bis","2009-05-15",{"$f":"G37-E37","v":7},{"$f":"IF(G49<>\"\",(G49*H37),0)","v":33.139240506329116},null,null,null,null,null,null,null,null,null,null,null,null,null,null,null,null,null,9650,{"$f":"$AA37-($AA37*AB$35/100)","v":5790},5693.5,5597,4680.25,7913,9650,9650,9650,9650,9650,9650,9650,9650,9650]
[null,"kg","% errechnet","ca. % ","Klassen","Preis 1","€/kg",null,null,null,null,null,null,null,null,null,null,null,null,null,null,null,null,null,null,null,4622,{"$f":"$AA38-($AA38*AB$35/100)","v":2773.2},2726.98,2680.76,2241.67,3790.04,4622,4622,4622,4622,4622,4622,4622,4622,4622]
[null,1480,{"$f":"IF(B39>1,(B39/$B$49*100),\"\")","v":46.835443037974684},null,"Klasse 1",5.5,{"$f":"IF(C39<>\"\",(F39*(C39/100)),F39*(D39/100))","v":2.5759493670886076}]
[null,490,{"$f":"IF(B40>1,(B40/$B$49*100),\"\")","v":15.50632911392405},null,"Klasse 1 vio",4.5,{"$f":"IF(C40<>\"\",(F40*(C40/100)),F40*(D40/100))","v":0.69778481012658222}]
[null,900,28.481012658227851,null,"Klasse 2",4,1.139240506329114]
[null,100,3.1645569620253164,null,"Klasse 2 vio",4,0.12658227848101267]
[null,80,2.5316455696202533,null,"Suppe",3,7.5949367088607611E-2]
[null,70,2.2151898734177213,null,"Bruch",2.5,5.5379746835443028E-2]
[null,40,1.2658227848101267,null,"Spitzen",5,6.3291139240506333E-2]
[null,null,"",null,null,null,0]
[null,null,"",null,null,null,0]
[null,null,"",null,null,null,0]
[null,{"$f":"SUM(B39:B48)","v":3160},null,{"$f":"SUM(D39:D48)","v":0},null,null,{"$f":"IF(SUM(G39:G48)=0,\"\",(SUM(G39:G48)))","v":4.7341772151898738}]
[null,{"$f":"B49/H37","v":451.42857142857144}]
[null,null,null,"Datum vom",{"$f":"G37+1","v":"2009-05-16"},"bis","2009-06-05",{"$f":"G51-E51","v":20},{"$f":"IF(G63<>\"\",(G63*H51),0)","v":82.904761904761898}]
[null,"kg","% errechnet","ca. % ","Klassen","Preis 1","€/kg"]
[null,2400,{"$f":"IF(B53>1,(B53/$B$63*100),\"\")","v":38.095238095238095},null,"Klasse 1",5,{"$f":"IF(C53<>\"\",(F53*(C53/100)),F53*(D53/100))","v":1.9047619047619047}]
[null,1600,{"$f":"IF(B54>1,(B54/$B$63*100),\"\")","v":25.396825396825395},null,"Klasse 1 vio",4.5,{"$f":"IF(C54<>\"\",(F54*(C54/100)),F54*(D54/100))","v":1.1428571428571428}]
[null,1300,20.634920634920633,null,"Klasse 2",3.5,0.72222222222222221]
[null,400,6.3492063492063489,null,"Klasse 2 vio",3,0.19047619047619047]
[null,350,5.5555555555555554,null,"Suppe",2,0.1111111111111111]
[null,190,3.0158730158730158,null,"Bruch",1.5,4.5238095238095237E-2]
[null,60,0.95238095238095244,null,"Spitzen",3,2.8571428571428574E-2]
[null,null,"",null,null,null,0]
[null,null,"",null,null,null,0]
[null,null,"",null,null,null,0]
[null,{"$f":"SUM(B53:B62)","v":6300},null,{"$f":"SUM(D53:D62)","v":0},null,null,{"$f":"IF(SUM(G53:G62)=0,\"\",(SUM(G53:G62)))","v":4.1452380952380947}]
[null,{"$f":"B63/H51","v":315}]
[null,null,null,"Datum vom",{"$f":"G51+1","v":"2009-06-06"},"bis","2009-06-25",{"$f":"G65-E65","v":19},{"$f":"IF(G77<>\"\",(G77*H65),0)","v":73.322110746671825}]
[null,"kg","% errechnet","ca. % ","Klassen","Preis 1","€/kg"]
[null,2200,{"$f":"IF(B67>1,(B67/$B$77*100),\"\")","v":42.446459579394173},null,"Klasse 1",4.9000000000000004,{"$f":"IF(C67<>\"\",(F67*(C67/100)),F67*(D67/100))","v":2.0798765193903148}]
[null,800,{"$f":"IF(B68>1,(B68/$B$77*100),\"\")","v":15.43507621068879},null,"Klasse 1 vio",4,{"$f":"IF(C68<>\"\",(F68*(C68/100)),F68*(D68/100))","v":0.61740304842755156}]
[null,1500,28.940767895041482,null,"Klasse 2",3,0.86822303685124447]
[null,400,7.7175381053443948,null,"Klasse 2 vio",2.5,0.19293845263360987]
[null,125,2.4117306579201232,null,"Suppe",1.5,3.617595986880185E-2]
[null,70,1.3505691684352692,null,"Bruch",1,1.3505691684352693E-2]
[null,88,1.6978583831757668,null,"Spitzen",3,5.0935751495273004E-2]
[null,null,"",null,null,null,0]
[null,null,"",null,null,null,0]
[null,null,"",null,null,null,0]
[null,{"$f":"SUM(B67:B76)","v":5183},null,{"$f":"SUM(D67:D76)","v":0},null,null,{"$f":"IF(SUM(G67:G76)=0,\"\",(SUM(G67:G76)))","v":3.8590584603511484}]
[null,{"$f":"B77/H65","v":272.78947368421052}]
[null,null,null,"Datum vom",{"$f":"G65+1","v":"2009-06-26"},"bis","2009-06-27",{"$f":"G79-E79","v":1},{"$f":"IF(G91<>\"\",(G91*H79),0)","v":4.704545454545455}]
[null,"kg","% errechnet","ca. % ","Klassen","Preis 1","€/kg"]
[null,95,{"$f":"IF(B81>1,(B81/$B$91*100),\"\")","v":43.18181818181818},null,"Klasse 1",6,{"$f":"IF(C81<>\"\",(F81*(C81/100)),F81*(D81/100))","v":2.5909090909090908}]
[null,40,{"$f":"IF(B82>1,(B82/$B$91*100),\"\")","v":18.181818181818183},null,"Klasse 1 vio",5,{"$f":"IF(C82<>\"\",(F82*(C82/100)),F82*(D82/100))","v":0.90909090909090917}]
[null,35,15.909090909090908,null,"Klasse 2",4,0.63636363636363635]
[null,10,4.5454545454545459,null,"Klasse 2 vio",3,0.13636363636363635]
[null,25,11.363636363636363,null,"Suppe",2,0.22727272727272727]
[null,5,2.2727272727272729,null,"Bruch",1,2.2727272727272728E-2]
[null,10,4.5454545454545459,null,"Spitzen",4,0.18181818181818182]
[null,null,"",null,null,null,0]
[null,null,"",null,null,null,0]
[null,null,"",null,null,null,0]
[null,{"$f":"SUM(B81:B90)","v":220},null,{"$f":"SUM(D81:D90)","v":0},null,null,{"$f":"IF(SUM(G81:G90)=0,\"\",(SUM(G81:G90)))","v":4.704545454545455}]
[null,{"$f":"B91/H79","v":220}]

{"sheet":"Maschinen","index":7,"n_rows":72,"n_cols":63,"rows_kept":72,"cut":false,"hidden":false,"merged":[[52,3,52,5]]}
[null,null,null,"Maschinenkosten"]
[]
[null,"Schlag",{"$f":"Betriebsdaten!C11","v":"Bester Feld"},{"$f":"Betriebsdaten!D11","v":0},{"$f":"Betriebsdaten!E11","v":0},{"$f":"Betriebsdaten!F11","v":0},{"$f":"Betriebsdaten!G11","v":0},{"$f":"Betriebsdaten!H11","v":0},{"$f":"Betriebsdaten!I11","v":0},{"$f":"Betriebsdaten!J11","v":0},{"$f":"Betriebsdaten!K11","v":0},{"$f":"Betriebsdaten!L11","v":0},{"$f":"Betriebsdaten!M11","v":0},{"$f":"Betriebsdaten!N11","v":0},{"$f":"Betriebsdaten!O11","v":0},{"$f":"Betriebsdaten!P11","v":0},{"$f":"Betriebsdaten!Q11","v":0},{"$f":"Betriebsdaten!R11","v":0},{"$f":"Betriebsdaten!S11","v":0},{"$f":"Betriebsdaten!T11","v":0},{"$f":"Betriebsdaten!U11","v":0},{"$f":"Betriebsdaten!V11","v":0},{"$f":"Betriebsdaten!W11","v":0},{"$f":"Betriebsdaten!X11","v":0},{"$f":"Betriebsdaten!Y11","v":0},{"$f":"Betriebsdaten!Z11","v":0},{"$f":"Betriebsdaten!AA11","v":25},{"$f":"Betriebsdaten!AB11","v":26},{"$f":"Betriebsdaten!AC11","v":27},{"$f":"Betriebsdaten!AD11","v":28},{"$f":"Betriebsdaten!AE11","v":29},{"$f":"Betriebsdaten!AF11","v":30},{"$f":"Betriebsdaten!AG11","v":31},{"$f":"Betriebsdaten!AH11","v":32},{"$f":"Betriebsdaten!AI11","v":33},{"$f":"Betriebsdaten!AJ11","v":34},{"$f":"Betriebsdaten!AK11","v":35},{"$f":"Betriebsdaten!AL11","v":36},{"$f":"Betriebsdaten!AM11","v":37},{"$f":"Betriebsdaten!AN11","v":38},{"$f":"Betriebsdaten!AO11","v":39},{"$f":"Betriebsdaten!AP11","v":40},{"$f":"Betriebsdaten!AQ11","v":41},{"$f":"Betriebsdaten!AR11","v":42},{"$f":"Betriebsdaten!AS11","v":43},{"$f":"Betriebsdaten!AT11","v":44},{"$f":"Betriebsdaten!AU11","v":45},{"$f":"Betriebsdaten!AV11","v":46},{"$f":"Betriebsdaten!AW11","v":47},{"$f":"Betriebsdaten!AX11","v":48},{"$f":"Betriebsdaten!AY11","v":49},{"$f":"Betriebsdaten!AZ11","v":50},{"$f":"Betriebsdaten!BA11","v":51},{"$f":"Betriebsdaten!BB11","v":52},{"$f":"Betriebsdaten!BC11","v":53},{"$f":"Betriebsdaten!BD11","v":54},{"$f":"Betriebsdaten!BE11","v":55},{"$f":"Betriebsdaten!BF11","v":56},{"$f":"Betriebsdaten!BG11","v":57},{"$f":"Betriebsdaten!BH11","v":58},{"$f":"Betriebsdaten!BI11","v":59},{"$f":"Betriebsdaten!BJ11","v":60},"Summe"]
[null,"Frucht",{"$f":"Betriebsdaten!C15","v":"Spargel"},{"$f":"Betriebsdaten!D15","v":0},{"$f":"Betriebsdaten!E15","v":0},{"$f":"Betriebsdaten!F15","v":0},{"$f":"Betriebsdaten!G15","v":0},{"$f":"Betriebsdaten!H15","v":0},{"$f":"Betriebsdaten!I15","v":0},{"$f":"Betriebsdaten!J15","v":0},{"$f":"Betriebsdaten!K15","v":0},{"$f":"Betriebsdaten!L15","v":0},{"$f":"Betriebsdaten!M15","v":0},{"$f":"Betriebsdaten!N15","v":0},{"$f":"Betriebsdaten!O15","v":0},{"$f":"Betriebsdaten!P15","v":0},{"$f":"Betriebsdaten!Q15","v":0},{"$f":"Betriebsdaten!R15","v":0},{"$f":"Betriebsdaten!S15","v":0},{"$f":"Betriebsdaten!T15","v":0},{"$f":"Betriebsdaten!U15","v":0},{"$f":"Betriebsdaten!V15","v":0},{"$f":"Betriebsdaten!W15","v":0},{"$f":"Betriebsdaten!X15","v":0},{"$f":"Betriebsdaten!Y15","v":0},{"$f":"Betriebsdaten!Z15","v":0},{"$f":"Betriebsdaten!AA15","v":0},{"$f":"Betriebsdaten!AB15","v":0},{"$f":"Betriebsdaten!AC15","v":0},{"$f":"Betriebsdaten!AD15","v":0},{"$f":"Betriebsdaten!AE15","v":0},{"$f":"Betriebsdaten!AF15","v":0},{"$f":"Betriebsdaten!AG15","v":0},{"$f":"Betriebsdaten!AH15","v":0},{"$f":"Betriebsdaten!AI15","v":0},{"$f":"Betriebsdaten!AJ15","v":0},{"$f":"Betriebsdaten!AK15","v":0},{"$f":"Betriebsdaten!AL15","v":0},{"$f":"Betriebsdaten!AM15","v":0},{"$f":"Betriebsdaten!AN15","v":0},{"$f":"Betriebsdaten!AO15","v":0},{"$f":"Betriebsdaten!AP15","v":0},{"$f":"Betriebsdaten!AQ15","v":0},{"$f":"Betriebsdaten!AR15","v":0},{"$f":"Betriebsdaten!AS15","v":0},{"$f":"Betriebsdaten!AT15","v":0},{"$f":"Betriebsdaten!AU15","v":0},{"$f":"Betriebsdaten!AV15","v":0},{"$f":"Betriebsdaten!AW15","v":0},{"$f":"Betriebsdaten!AX15","v":0},{"$f":"Betriebsdaten!AY15","v":0},{"$f":"Betriebsdaten!AZ15","v":0},{"$f":"Betriebsdaten!BA15","v":0},{"$f":"Betriebsdaten!BB15","v":0},{"$f":"Betriebsdaten!BC15","v":0},{"$f":"Betriebsdaten!BD15","v":0},{"$f":"Betriebsdaten!BE15","v":0},{"$f":"Betriebsdaten!BF15","v":0},{"$f":"Betriebsdaten!BG15","v":0},{"$f":"Betriebsdaten!BH15","v":0},{"$f":"Betriebsdaten!BI15","v":0},{"$f":"Betriebsdaten!BJ15","v":0}]
[null,"Sorte",{"$f":"Betriebsdaten!C16","v":"Gijnlim"},{"$f":"Betriebsdaten!D16","v":0},{"$f":"Betriebsdaten!E16","v":0},{"$f":"Betriebsdaten!F16","v":0},{"$f":"Betriebsdaten!G16","v":0},{"$f":"Betriebsdaten!H16","v":0},{"$f":"Betriebsdaten!I16","v":0},{"$f":"Betriebsdaten!J16","v":0},{"$f":"Betriebsdaten!K16","v":0},{"$f":"Betriebsdaten!L16","v":0},{"$f":"Betriebsdaten!M16","v":0},{"$f":"Betriebsdaten!N16","v":0},{"$f":"Betriebsdaten!O16","v":0},{"$f":"Betriebsdaten!P16","v":0},{"$f":"Betriebsdaten!Q16","v":0},{"$f":"Betriebsdaten!R16","v":0},{"$f":"Betriebsdaten!S16","v":0},{"$f":"Betriebsdaten!T16","v":0},{"$f":"Betriebsdaten!U16","v":0},{"$f":"Betriebsdaten!V16","v":0},{"$f":"Betriebsdaten!W16","v":0},{"$f":"Betriebsdaten!X16","v":0},{"$f":"Betriebsdaten!Y16","v":0},{"$f":"Betriebsdaten!Z16","v":0},{"$f":"Betriebsdaten!AA16","v":0},{"$f":"Betriebsdaten!AB16","v":0},{"$f":"Betriebsdaten!AC16","v":0},{"$f":"Betriebsdaten!AD16","v":0},{"$f":"Betriebsdaten!AE16","v":0},{"$f":"Betriebsdaten!AF16","v":0},{"$f":"Betriebsdaten!AG16","v":0},{"$f":"Betriebsdaten!AH16","v":0},{"$f":"Betriebsdaten!AI16","v":0},{"$f":"Betriebsdaten!AJ16","v":0},{"$f":"Betriebsdaten!AK16","v":0},{"$f":"Betriebsdaten!AL16","v":0},{"$f":"Betriebsdaten!AM16","v":0},{"$f":"Betriebsdaten!AN16","v":0},{"$f":"Betriebsdaten!AO16","v":0},{"$f":"Betriebsdaten!AP16","v":0},{"$f":"Betriebsdaten!AQ16","v":0},{"$f":"Betriebsdaten!AR16","v":0},{"$f":"Betriebsdaten!AS16","v":0},{"$f":"Betriebsdaten!AT16","v":0},{"$f":"Betriebsdaten!AU16","v":0},{"$f":"Betriebsdaten!AV16","v":0},{"$f":"Betriebsdaten!AW16","v":0},{"$f":"Betriebsdaten!AX16","v":0},{"$f":"Betriebsdaten!AY16","v":0},{"$f":"Betriebsdaten!AZ16","v":0},{"$f":"Betriebsdaten!BA16","v":0},{"$f":"Betriebsdaten!BB16","v":0},{"$f":"Betriebsdaten!BC16","v":0},{"$f":"Betriebsdaten!BD16","v":0},{"$f":"Betriebsdaten!BE16","v":0},{"$f":"Betriebsdaten!BF16","v":0},{"$f":"Betriebsdaten!BG16","v":0},{"$f":"Betriebsdaten!BH16","v":0},{"$f":"Betriebsdaten!BI16","v":0},{"$f":"Betriebsdaten!BJ16","v":0}]
[null,"ha",{"$f":"Betriebsdaten!C17","v":3.8},{"$f":"Betriebsdaten!D17","v":0},{"$f":"Betriebsdaten!E17","v":0},{"$f":"Betriebsdaten!F17","v":0},{"$f":"Betriebsdaten!G17","v":0},{"$f":"Betriebsdaten!H17","v":0},{"$f":"Betriebsdaten!I17","v":0},{"$f":"Betriebsdaten!J17","v":0},{"$f":"Betriebsdaten!K17","v":0},{"$f":"Betriebsdaten!L17","v":0},{"$f":"Betriebsdaten!M17","v":0},{"$f":"Betriebsdaten!N17","v":0},{"$f":"Betriebsdaten!O17","v":0},{"$f":"Betriebsdaten!P17","v":0},{"$f":"Betriebsdaten!Q17","v":0},{"$f":"Betriebsdaten!R17","v":0},{"$f":"Betriebsdaten!S17","v":0},{"$f":"Betriebsdaten!T17","v":0},{"$f":"Betriebsdaten!U17","v":0},{"$f":"Betriebsdaten!V17","v":0},{"$f":"Betriebsdaten!W17","v":0},{"$f":"Betriebsdaten!X17","v":0},{"$f":"Betriebsdaten!Y17","v":0},{"$f":"Betriebsdaten!Z17","v":0},{"$f":"Betriebsdaten!AA17","v":0},{"$f":"Betriebsdaten!AB17","v":0},{"$f":"Betriebsdaten!AC17","v":0},{"$f":"Betriebsdaten!AD17","v":0},{"$f":"Betriebsdaten!AE17","v":0},{"$f":"Betriebsdaten!AF17","v":0},{"$f":"Betriebsdaten!AG17","v":0},{"$f":"Betriebsdaten!AH17","v":0},{"$f":"Betriebsdaten!AI17","v":0},{"$f":"Betriebsdaten!AJ17","v":0},{"$f":"Betriebsdaten!AK17","v":0},{"$f":"Betriebsdaten!AL17","v":0},{"$f":"Betriebsdaten!AM17","v":0},{"$f":"Betriebsdaten!AN17","v":0},{"$f":"Betriebsdaten!AO17","v":0},{"$f":"Betriebsdaten!AP17","v":0},{"$f":"Betriebsdaten!AQ17","v":0},{"$f":"Betriebsdaten!AR17","v":0},{"$f":"Betriebsdaten!AS17","v":0},{"$f":"Betriebsdaten!AT17","v":0},{"$f":"Betriebsdaten!AU17","v":0},{"$f":"Betriebsdaten!AV17","v":0},{"$f":"Betriebsdaten!AW17","v":0},{"$f":"Betriebsdaten!AX17","v":0},{"$f":"Betriebsdaten!AY17","v":0},{"$f":"Betriebsdaten!AZ17","v":0},{"$f":"Betriebsdaten!BA17","v":0},{"$f":"Betriebsdaten!BB17","v":0},{"$f":"Betriebsdaten!BC17","v":0},{"$f":"Betriebsdaten!BD17","v":0},{"$f":"Betriebsdaten!BE17","v":0},{"$f":"Betriebsdaten!BF17","v":0},{"$f":"Betriebsdaten!BG17","v":0},{"$f":"Betriebsdaten!BH17","v":0},{"$f":"Betriebsdaten!BI17","v":0},{"$f":"Betriebsdaten!BJ17","v":0},{"$f":"SUM(C6:BJ6)","v":3.8}]
[null,null,null,"Kosten/ha/Jahr"]
[null,"Grubbern",22.5,null,null,null,null,null,null,null,null,null,null,null,null,null,null,null,null,null,null,null,null,null,null,null,null,null,null,null,null,null,null,null,null,null,null,null,null,null,null,null,null,null,null,null,null,null,null,null,null,null,null,null,null,null,null,null,null,null,null,null,{"$f":"(C8*$C$6)+(D8*$D$6)+(E8*$E$6)+(F8*$F$6)+(G8*$G$6)+(H8*$H$6)+(I8*$I$6)+(J8*$J$6)+(K8*$K$6)+(L8*$L$6)+(M8*$M$6)+(N8*$N$6)+(O8*$O$6)+(P8*$P$6)+(Q8*$Q$6)+(R8*$R$6)+(S8*$S$6)+(T8*$T$6)+(U8*$U$6)+(V8*$V$6)+(W8*$W$6)+(X8*$X$6)+(Y8*$Y$6)+(Z8*$Z$6)+(AA8*$AA$6)+(AB8*$AB$6)+(AC8*$AC$6)+(AD8*$AD$6)+(AE8*$AE$6)+(AF8*$AF$6)+(AG8*$AG$6)+(AH8*$AH$6)+(AI8*$AI$6)+(AJ8*$AJ$6)+(AK8*$AK$6)+(AL8*$AL$6)+(AM8*$AM$6)+(AN8*$AN$6)+(AO8*$AO$6)+(AP8*$AP$6)+(AQ8*$AQ$6)+(AR8*$AR$6)+(AS8*$AS$6)+(AT8*$AT$6)+(AU8*$AU$6)+(AV8*$AV$6)+(AW8*$AW$6)+(AX8*$AX$6)+(AY8*$AY$6)+(AZ8*$AZ$6)+(BA8*$BA$6)+(BB8*$BB$6)+(BC8*$BC$6)+(BD8*$BD$6)+(BE8*$BE$6)+(BF8*$BF$6)*(BG8*$BG$6)+(BH8*$BH$6)+(BI8*$BI$6)+(BJ8*$BJ$6)","v":85.5}]
[null,"Damm fräsen",185,null,null,null,null,null,null,null,null,null,null,null,null,null,null,null,null,null,null,null,null,null,null,null,null,null,null,null,null,null,null,null,null,null,null,null,null,null,null,null,null,null,null,null,null,null,null,null,null,null,null,null,null,null,null,null,null,null,null,null,{"$f":"(C9*$C$6)+(D9*$D$6)+(E9*$E$6)+(F9*$F$6)+(G9*$G$6)+(H9*$H$6)+(I9*$I$6)+(J9*$J$6)+(K9*$K$6)+(L9*$L$6)+(M9*$M$6)+(N9*$N$6)+(O9*$O$6)+(P9*$P$6)+(Q9*$Q$6)+(R9*$R$6)+(S9*$S$6)+(T9*$T$6)+(U9*$U$6)+(V9*$V$6)+(W9*$W$6)+(X9*$X$6)+(Y9*$Y$6)+(Z9*$Z$6)+(AA9*$AA$6)+(AB9*$AB$6)+(AC9*$AC$6)+(AD9*$AD$6)+(AE9*$AE$6)+(AF9*$AF$6)+(AG9*$AG$6)+(AH9*$AH$6)+(AI9*$AI$6)+(AJ9*$AJ$6)+(AK9*$AK$6)+(AL9*$AL$6)+(AM9*$AM$6)+(AN9*$AN$6)+(AO9*$AO$6)+(AP9*$AP$6)+(AQ9*$AQ$6)+(AR9*$AR$6)+(AS9*$AS$6)+(AT9*$AT$6)+(AU9*$AU$6)+(AV9*$AV$6)+(AW9*$AW$6)+(AX9*$AX$6)+(AY9*$AY$6)+(AZ9*$AZ$6)+(BA9*$BA$6)+(BB9*$BB$6)+(BC9*$BC$6)+(BD9*$BD$6)+(BE9*$BE$6)+(BF9*$BF$6)*(BG9*$BG$6)+(BH9*$BH$6)+(BI9*$BI$6)+(BJ9*$BJ$6)","v":703}]
[null,"Folie legen 2x",170,null,null,null,null,null,null,null,null,null,null,null,null,null,null,null,null,null,null,null,null,null,null,null,null,null,null,null,null,null,null,null,null,null,null,null,null,null,null,null,null,null,null,null,null,null,null,null,null,null,null,null,null,null,null,null,null,null,null,null,646]
[null,"Folie wickeln 2x",190,null,null,null,null,null,null,null,null,null,null,null,null,null,null,null,null,null,null,null,null,null,null,null,null,null,null,null,null,null,null,null,null,null,null,null,null,null,null,null,null,null,null,null,null,null,null,null,null,null,null,null,null,null,null,null,null,null,null,null,722]
[null,"abdämmen",22,null,null,null,null,null,null,null,null,null,null,null,null,null,null,null,null,null,null,null,null,null,null,null,null,null,null,null,null,null,null,null,null,null,null,null,null,null,null,null,null,null,null,null,null,null,null,null,null,null,null,null,null,null,null,null,null,null,null,null,83.6]
[null,"düngen",13.5,null,null,null,null,null,null,null,null,null,null,null,null,null,null,null,null,null,null,null,null,null,null,null,null,null,null,null,null,null,null,null,null,null,null,null,null,null,null,null,null,null,null,null,null,null,null,null,null,null,null,null,null,null,null,null,null,null,null,null,51.3]
[null,"Reihen lockern",18,null,null,null,null,null,null,null,null,null,null,null,null,null,null,null,null,null,null,null,null,null,null,null,null,null,null,null,null,null,null,null,null,null,null,null,null,null,null,null,null,null,null,null,null,null,null,null,null,null,null,null,null,null,null,null,null,null,null,null,68.399999999999991]
[null,"Begrünung säen",53,null,null,null,null,null,null,null,null,null,null,null,null,null,null,null,null,null,null,null,null,null,null,null,null,null,null,null,null,null,null,null,null,null,null,null,null,null,null,null,null,null,null,null,null,null,null,null,null,null,null,null,null,null,null,null,null,null,null,null,201.39999999999998]
[null,null,null,null,null,null,null,null,null,null,null,null,null,null,null,null,null,null,null,null,null,null,null,null,null,null,null,null,null,null,null,null,null,null,null,null,null,null,null,null,null,null,null,null,null,null,null,null,null,null,null,null,null,null,null,null,null,null,null,null,null,null,0]
[null,null,null,null,null,null,null,null,null,null,null,null,null,null,null,null,null,null,null,null,null,null,null,null,null,null,null,null,null,null,null,null,null,null,null,null,null,null,null,null,null,null,null,null,null,null,null,null,null,null,null,null,null,null,null,null,null,null,null,null,null,null,0]
[null,"schlegeln",42.5,null,null,null,null,null,null,null,null,null,null,null,null,null,null,null,null,null,null,null,null,null,null,null,null,null,null,null,null,null,null,null,null,null,null,null,null,null,null,null,null,null,null,null,null,null,null,null,null,null,null,null,null,null,null,null,null,null,null,null,161.5]
[null,"Scheibenegge",24.5,null,null,null,null,null,null,null,null,null,null,null,null,null,null,null,null,null,null,null,null,null,null,null,null,null,null,null,null,null,null,null,null,null,null,null,null,null,null,null,null,null,null,null,null,null,null,null,null,null,null,null,null,null,null,null,null,null,null,null,93.1]
[null,"Scheibenegge",24.5,null,null,null,null,null,null,null,null,null,null,null,null,null,null,null,null,null,null,null,null,null,null,null,null,null,null,null,null,null,null,null,null,null,null,null,null,null,null,null,null,null,null,null,null,null,null,null,null,null,null,null,null,null,null,null,null,null,null,null,93.1]
[null,"Winterdamm anpflü.",53,null,null,null,null,null,null,null,null,null,null,null,null,null,null,null,null,null,null,null,null,null,null,null,null,null,null,null,null,null,null,null,null,null,null,null,null,null,null,null,null,null,null,null,null,null,null,null,null,null,null,null,null,null,null,null,null,null,null,null,201.39999999999998]
[null,null,null,null,null,null,null,null,null,null,null,null,null,null,null,null,null,null,null,null,null,null,null,null,null,null,null,null,null,null,null,null,null,null,null,null,null,null,null,null,null,null,null,null,null,null,null,null,null,null,null,null,null,null,null,null,null,null,null,null,null,null,0]
[null,"Erntehilfe",110,null,null,null,null,null,null,null,null,null,null,null,null,null,null,null,null,null,null,null,null,null,null,null,null,null,null,null,null,null,null,null,null,null,null,null,null,null,null,null,null,null,null,null,null,null,null,null,null,null,null,null,null,null,null,null,null,null,null,null,418]
[null,null,null,null,null,null,null,null,null,null,null,null,null,null,null,null,null,null,null,null,null,null,null,null,null,null,null,null,null,null,null,null,null,null,null,null,null,null,null,null,null,null,null,null,null,null,null,null,null,null,null,null,null,null,null,null,null,null,null,null,null,null,0]
[null,null,null,null,null,null,null,null,null,null,null,null,null,null,null,null,null,null,null,null,null,null,null,null,null,null,null,null,null,null,null,null,null,null,null,null,null,null,null,null,null,null,null,null,null,null,null,null,null,null,null,null,null,null,null,null,null,null,null,null,null,null,0]
[null,null,null,null,null,null,null,null,null,null,null,null,null,null,null,null,null,null,null,null,null,null,null,null,null,null,null,null,null,null,null,null,null,null,null,null,null,null,null,null,null,null,null,null,null,null,null,null,null,null,null,null,null,null,null,null,null,null,null,null,null,null,0]
[null,null,null,null,null,null,null,null,null,null,null,null,null,null,null,null,null,null,null,null,null,null,null,null,null,null,null,null,null,null,null,null,null,null,null,null,null,null,null,null,null,null,null,null,null,null,null,null,null,null,null,null,null,null,null,null,null,null,null,null,null,null,0]
[null,null,null,null,null,null,null,null,null,null,null,null,null,null,null,null,null,null,null,null,null,null,null,null,null,null,null,null,null,null,null,null,null,null,null,null,null,null,null,null,null,null,null,null,null,null,null,null,null,null,null,null,null,null,null,null,null,null,null,null,null,null,0]
[null,null,null,null,null,null,null,null,null,null,null,null,null,null,null,null,null,null,null,null,null,null,null,null,null,null,null,null,null,null,null,null,null,null,null,null,null,null,null,null,null,null,null,null,null,null,null,null,null,null,null,null,null,null,null,null,null,null,null,null,null,null,0]
[null,null,null,null,null,null,null,null,null,null,null,null,null,null,null,null,null,null,null,null,null,null,null,null,null,null,null,null,null,null,null,null,null,null,null,null,null,null,null,null,null,null,null,null,null,null,null,null,null,null,null,null,null,null,null,null,null,null,null,null,null,null,0]
[null,null,null,null,null,null,null,null,null,null,null,null,null,null,null,null,null,null,null,null,null,null,null,null,null,null,null,null,null,null,null,null,null,null,null,null,null,null,null,null,null,null,null,null,null,null,null,null,null,null,null,null,null,null,null,null,null,null,null,null,null,null,0]
[null,null,null,null,null,null,null,null,null,null,null,null,null,null,null,null,null,null,null,null,null,null,null,null,null,null,null,null,null,null,null,null,null,null,null,null,null,null,null,null,null,null,null,null,null,null,null,null,null,null,null,null,null,null,null,null,null,null,null,null,null,null,0]
[null,null,null,null,null,null,null,null,null,null,null,null,null,null,null,null,null,null,null,null,null,null,null,null,null,null,null,null,null,null,null,null,null,null,null,null,null,null,null,null,null,null,null,null,null,null,null,null,null,null,null,null,null,null,null,null,null,null,null,null,null,null,0]
[null,null,null,null,null,null,null,null,null,null,null,null,null,null,null,null,null,null,null,null,null,null,null,null,null,null,null,null,null,null,null,null,null,null,null,null,null,null,null,null,null,null,null,null,null,null,null,null,null,null,null,null,null,null,null,null,null,null,null,null,null,null,0]
[null,null,null,null,null,null,null,null,null,null,null,null,null,null,null,null,null,null,null,null,null,null,null,null,null,null,null,null,null,null,null,null,null,null,null,null,null,null,null,null,null,null,null,null,null,null,null,null,null,null,null,null,null,null,null,null,null,null,null,null,null,null,0]
[null,null,null,null,null,null,null,null,null,null,null,null,null,null,null,null,null,null,null,null,null,null,null,null,null,null,null,null,null,null,null,null,null,null,null,null,null,null,null,null,null,null,null,null,null,null,null,null,null,null,null,null,null,null,null,null,null,null,null,null,null,null,0]
[null,null,null,null,null,null,null,null,null,null,null,null,null,null,null,null,null,null,null,null,null,null,null,null,null,null,null,null,null,null,null,null,null,null,null,null,null,null,null,null,null,null,null,null,null,null,null,null,null,null,null,null,null,null,null,null,null,null,null,null,null,null,0]
[null,null,null,null,null,null,null,null,null,null,null,null,null,null,null,null,null,null,null,null,null,null,null,null,null,null,null,null,null,null,null,null,null,null,null,null,null,null,null,null,null,null,null,null,null,null,null,null,null,null,null,null,null,null,null,null,null,null,null,null,null,null,0]
[null,null,null,null,null,null,null,null,null,null,null,null,null,null,null,null,null,null,null,null,null,null,null,null,null,null,null,null,null,null,null,null,null,null,null,null,null,null,null,null,null,null,null,null,null,null,null,null,null,null,null,null,null,null,null,null,null,null,null,null,null,null,0]
[null,null,null,null,null,null,null,null,null,null,null,null,null,null,null,null,null,null,null,null,null,null,null,null,null,null,null,null,null,null,null,null,null,null,null,null,null,null,null,null,null,null,null,null,null,null,null,null,null,null,null,null,null,null,null,null,null,null,null,null,null,null,0]
[null,null,null,null,null,null,null,null,null,null,null,null,null,null,null,null,null,null,null,null,null,null,null,null,null,null,null,null,null,null,null,null,null,null,null,null,null,null,null,null,null,null,null,null,null,null,null,null,null,null,null,null,null,null,null,null,null,null,null,null,null,null,0]
[null,null,null,null,null,null,null,null,null,null,null,null,null,null,null,null,null,null,null,null,null,null,null,null,null,null,null,null,null,null,null,null,null,null,null,null,null,null,null,null,null,null,null,null,null,null,null,null,null,null,null,null,null,null,null,null,null,null,null,null,null,null,0]
[null,null,null,null,null,null,null,null,null,null,null,null,null,null,null,null,null,null,null,null,null,null,null,null,null,null,null,null,null,null,null,null,null,null,null,null,null,null,null,null,null,null,null,null,null,null,null,null,null,null,null,null,null,null,null,null,null,null,null,null,null,null,0]
[null,null,null,null,null,null,null,null,null,null,null,null,null,null,null,null,null,null,null,null,null,null,null,null,null,null,null,null,null,null,null,null,null,null,null,null,null,null,null,null,null,null,null,null,null,null,null,null,null,null,null,null,null,null,null,null,null,null,null,null,null,null,0]
[null,null,null,null,null,null,null,null,null,null,null,null,null,null,null,null,null,null,null,null,null,null,null,null,null,null,null,null,null,null,null,null,null,null,null,null,null,null,null,null,null,null,null,null,null,null,null,null,null,null,null,null,null,null,null,null,null,null,null,null,null,null,0]
[null,null,null,null,null,null,null,null,null,null,null,null,null,null,null,null,null,null,null,null,null,null,null,null,null,null,null,null,null,null,null,null,null,null,null,null,null,null,null,null,null,null,null,null,null,null,null,null,null,null,null,null,null,null,null,null,null,null,null,null,null,null,0]
[null,null,null,null,null,null,null,null,null,null,null,null,null,null,null,null,null,null,null,null,null,null,null,null,null,null,null,null,null,null,null,null,null,null,null,null,null,null,null,null,null,null,null,null,null,null,null,null,null,null,null,null,null,null,null,null,null,null,null,null,null,null,0]
[null,null,null,null,null,null,null,null,null,null,null,null,null,null,null,null,null,null,null,null,null,null,null,null,null,null,null,null,null,null,null,null,null,null,null,null,null,null,null,null,null,null,null,null,null,null,null,null,null,null,null,null,null,null,null,null,null,null,null,null,null,null,0]
[null,null,null,null,null,null,null,null,null,null,null,null,null,null,null,null,null,null,null,null,null,null,null,null,null,null,null,null,null,null,null,null,null,null,null,null,null,null,null,null,null,null,null,null,null,null,null,null,null,null,null,null,null,null,null,null,null,null,null,null,null,null,0]
[null,null,null,null,null,null,null,null,null,null,null,null,null,null,null,null,null,null,null,null,null,null,null,null,null,null,null,null,null,null,null,null,null,null,null,null,null,null,null,null,null,null,null,null,null,null,null,null,null,null,null,null,null,null,null,null,null,null,null,null,null,null,0]
[null,"Kosten /ha",{"$f":"SUM(C8:C50)","v":928.5},0,0,0,0,0,0,0,0,{"$f":"SUM(L8:L50)","v":0},0,0,0,0,0,0,0,0,0,{"$f":"SUM(V8:V50)","v":0},{"$f":"SUM(W8:W50)","v":0},0,0,0,0,0,0,0,0,0,{"$f":"SUM(AG8:AG50)","v":0},0,0,0,0,0,0,0,0,0,0,0,0,0,0,0,0,0,0,0,0,0,0,0,0,0,0,0,0,0]
[null,"Kosten gesamt",{"$f":"C51*C6","v":3528.2999999999997},{"$f":"D51*D6","v":0},0,0,0,0,0,0,0,0,0,0,0,0,0,0,0,0,0,{"$f":"V51*V6","v":0},{"$f":"W51*W6","v":0},0,0,0,0,0,0,0,0,0,{"$f":"AG51*AG6","v":0},0,0,0,0,0,0,0,0,0,0,0,0,0,0,0,0,0,0,0,0,0,0,0,0,0,0,0,0,0,{"$f":"SUM(C52:BJ52)","v":3528.2999999999997}]
[null,null,null,"Lohnunternehmerkosten/ha/Jahr"]
[null,"LU-Kosten Gülle",null,null,null,null,null,null,null,null,null,null,null,null,null,null,null,null,null,null,null,null,null,null,null,null,null,null,null,null,null,null,null,null,null,null,null,null,null,null,null,null,null,null,null,null,null,null,null,null,null,null,null,null,null,null,null,null,null,null,null,null,{"$f":"(C54*$C$6)+(D54*$D$6)+(E54*$E$6)+(F54*$F$6)+(G54*$G$6)+(H54*$H$6)+(I54*$I$6)+(J54*$J$6)+(K54*$K$6)+(L54*$L$6)+(M54*$M$6)+(N54*$N$6)+(O54*$O$6)+(P54*$P$6)+(Q54*$Q$6)+(R54*$R$6)+(S54*$S$6)+(T54*$T$6)+(U54*$U$6)+(V54*$V$6)+(W54*$W$6)+(X54*$X$6)+(Y54*$Y$6)+(Z54*$Z$6)+(AA54*$AA$6)+(AB54*$AB$6)+(AC54*$AC$6)+(AD54*$AD$6)+(AE54*$AE$6)+(AF54*$AF$6)+(AG54*$AG$6)+(AH54*$AH$6)+(AI54*$AI$6)+(AJ54*$AJ$6)+(AK54*$AK$6)+(AL54*$AL$6)+(AM54*$AM$6)+(AN54*$AN$6)+(AO54*$AO$6)+(AP54*$AP$6)+(AQ54*$AQ$6)+(AR54*$AR$6)+(AS54*$AS$6)+(AT54*$AT$6)+(AU54*$AU$6)+(AV54*$AV$6)+(AW54*$AW$6)+(AX54*$AX$6)+(AY54*$AY$6)+(AZ54*$AZ$6)+(BA54*$BA$6)+(BB54*$BB$6)+(BC54*$BC$6)+(BD54*$BD$6)+(BE54*$BE$6)+(BF54*$BF$6)*(BG54*$BG$6)+(BH54*$BH$6)+(BI54*$BI$6)+(BJ54*$BJ$6)","v":0}]
[null,"LU-Kosten Ernte",null,null,null,null,null,null,null,null,null,null,null,null,null,null,null,null,null,null,null,null,null,null,null,null,null,null,null,null,null,null,null,null,null,null,null,null,null,null,null,null,null,null,null,null,null,null,null,null,null,null,null,null,null,null,null,null,null,null,null,null,0]
[null,"LU-Kosten PSM",520,null,null,null,null,null,null,null,null,null,null,null,null,null,null,null,null,null,null,null,null,null,null,null,null,null,null,null,null,null,null,null,null,null,null,null,null,null,null,null,null,null,null,null,null,null,null,null,null,null,null,null,null,null,null,null,null,null,null,null,1976]
[null,"LU-Kosten Düngung",null,null,null,null,null,null,null,null,null,null,null,null,null,null,null,null,null,null,null,null,null,null,null,null,null,null,null,null,null,null,null,null,null,null,null,null,null,null,null,null,null,null,null,null,null,null,null,null,null,null,null,null,null,null,null,null,null,null,null,null,0]
[null,null,null,null,null,null,null,null,null,null,null,null,null,null,null,null,null,null,null,null,null,null,null,null,null,null,null,null,null,null,null,null,null,null,null,null,null,null,null,null,null,null,null,null,null,null,null,null,null,null,null,null,null,null,null,null,null,null,null,null,null,null,0]
[null,null,null,null,null,null,null,null,null,null,null,null,null,null,null,null,null,null,null,null,null,null,null,null,null,null,null,null,null,null,null,null,null,null,null,null,null,null,null,null,null,null,null,null,null,null,null,null,null,null,null,null,null,null,null,null,null,null,null,null,null,null,0]
[]
[]
[]
[null,null,null,null,null,null,null,null,null,null,null,null,null,null,null,null,null,null,null,null,null,null,null,null,null,null,null,null,null,null,null,null,null,null,null,null,null,null,null,null,null,null,null,null,null,null,null,null,null,null,null,null,null,null,null,null,null,null,null,null,null,null,0]
[null,null,null,null,null,null,null,null,null,null,null,null,null,null,null,null,null,null,null,null,null,null,null,null,null,null,null,null,null,null,null,null,null,null,null,null,null,null,null,null,null,null,null,null,null,null,null,null,null,null,null,null,null,null,null,null,null,null,null,null,null,null,0]
[null,null,null,null,null,null,null,null,null,null,null,null,null,null,null,null,null,null,null,null,null,null,null,null,null,null,null,null,null,null,null,null,null,null,null,null,null,null,null,null,null,null,null,null,null,null,null,null,null,null,null,null,null,null,null,null,null,null,null,null,null,null,0]
[null,null,null,null,null,null,null,null,null,null,null,null,null,null,null,null,null,null,null,null,null,null,null,null,null,null,null,null,null,null,null,null,null,null,null,null,null,null,null,null,null,null,null,null,null,null,null,null,null,null,null,null,null,null,null,null,null,null,null,null,null,null,0]
[null,null,null,null,null,null,null,null,null,null,null,null,null,null,null,null,null,null,null,null,null,null,null,null,null,null,null,null,null,null,null,null,null,null,null,null,null,null,null,null,null,null,null,null,null,null,null,null,null,null,null,null,null,null,null,null,null,null,null,null,null,null,0]
[null,"Kosten LU /ha",{"$f":"SUM(C54:C67)","v":520},{"$f":"SUM(D54:D67)","v":0},0,0,0,0,0,0,0,0,0,0,0,0,0,0,0,0,0,{"$f":"SUM(V54:V67)","v":0},{"$f":"SUM(W54:W67)","v":0},0,0,0,0,0,0,0,0,0,{"$f":"SUM(AG54:AG67)","v":0},0,0,0,0,0,0,0,0,0,0,0,0,0,0,0,0,0,0,0,0,0,0,0,0,0,0,0,0,0]
[null,"Kosten LU gesamt",{"$f":"C68*C6","v":1976},{"$f":"D68*D6","v":0},0,0,0,0,0,0,0,0,0,0,0,0,0,0,0,0,0,{"$f":"V68*V6","v":0},{"$f":"W68*W6","v":0},0,0,0,0,0,0,0,0,0,{"$f":"AG68*AG6","v":0},0,0,0,0,0,0,0,0,0,0,0,0,0,0,0,0,0,0,0,0,0,0,0,0,0,0,0,0,0,{"$f":"SUM(C69:BJ69)","v":1976}]
[]
[null,"Kosten/ha",{"$f":"C51+C68","v":1448.5},{"$f":"D51+D68","v":0},0,0,0,0,0,0,0,0,0,0,0,0,0,0,0,0,{"$f":"U51+U68","v":0},{"$f":"V51+V68","v":0},{"$f":"W51+W68","v":0},0,0,0,0,0,0,0,0,0,{"$f":"AG51+AG68","v":0},0,0,0,0,0,0,0,0,0,0,0,0,0,0,0,0,0,0,0,0,0,0,0,0,0,0,0,0,0]
[null,"Kosten gesamt",{"$f":"C52+C69","v":5504.2999999999993},{"$f":"D52+D69","v":0},0,0,0,0,0,0,0,0,0,0,0,0,0,0,0,0,{"$f":"U52+U69","v":0},{"$f":"V52+V69","v":0},{"$f":"W52+W69","v":0},0,0,0,0,0,0,0,0,0,{"$f":"AG52+AG69","v":0},0,0,0,0,0,0,0,0,0,0,0,0,0,0,0,0,0,0,0,0,0,0,0,0,0,0,0,0,0,{"$f":"SUM(C72:BJ72)","v":5504.2999999999993}]

{"sheet":"Auswertung","index":8,"n_rows":45,"n_cols":63,"rows_kept":45,"cut":false,"hidden":false,"merged":[]}
[]
[null,null,"Betriebszweigauswertung ",null,null,null,"Betrieb:",{"$f":"Betriebsdaten!D4","v":"Große Dankbar"}]
[null,"Schlag",{"$f":"Betriebsdaten!C11","v":"Bester Feld"},{"$f":"Betriebsdaten!D11","v":0},{"$f":"Betriebsdaten!E11","v":0},{"$f":"Betriebsdaten!F11","v":0},{"$f":"Betriebsdaten!G11","v":0},{"$f":"Betriebsdaten!H11","v":0},{"$f":"Betriebsdaten!I11","v":0},{"$f":"Betriebsdaten!J11","v":0},{"$f":"Betriebsdaten!K11","v":0},{"$f":"Betriebsdaten!L11","v":0},{"$f":"Betriebsdaten!M11","v":0},{"$f":"Betriebsdaten!N11","v":0},{"$f":"Betriebsdaten!O11","v":0},{"$f":"Betriebsdaten!P11","v":0},{"$f":"Betriebsdaten!Q11","v":0},{"$f":"Betriebsdaten!R11","v":0},{"$f":"Betriebsdaten!S11","v":0},{"$f":"Betriebsdaten!T11","v":0},{"$f":"Betriebsdaten!U11","v":0},{"$f":"Betriebsdaten!V11","v":0},{"$f":"Betriebsdaten!W11","v":0},{"$f":"Betriebsdaten!X11","v":0},{"$f":"Betriebsdaten!Y11","v":0},{"$f":"Betriebsdaten!Z11","v":0},{"$f":"Betriebsdaten!AA11","v":25},{"$f":"Betriebsdaten!AB11","v":26},{"$f":"Betriebsdaten!AC11","v":27},{"$f":"Betriebsdaten!AD11","v":28},{"$f":"Betriebsdaten!AE11","v":29},{"$f":"Betriebsdaten!AF11","v":30},{"$f":"Betriebsdaten!AG11","v":31},{"$f":"Betriebsdaten!AH11","v":32},{"$f":"Betriebsdaten!AI11","v":33},{"$f":"Betriebsdaten!AJ11","v":34},{"$f":"Betriebsdaten!AK11","v":35},{"$f":"Betriebsdaten!AL11","v":36},{"$f":"Betriebsdaten!AM11","v":37},{"$f":"Betriebsdaten!AN11","v":38},{"$f":"Betriebsdaten!AO11","v":39},{"$f":"Betriebsdaten!AP11","v":40},{"$f":"Betriebsdaten!AQ11","v":41},{"$f":"Betriebsdaten!AR11","v":42},{"$f":"Betriebsdaten!AS11","v":43},{"$f":"Betriebsdaten!AT11","v":44},{"$f":"Betriebsdaten!AU11","v":45},{"$f":"Betriebsdaten!AV11","v":46},{"$f":"Betriebsdaten!AW11","v":47},{"$f":"Betriebsdaten!AX11","v":48},{"$f":"Betriebsdaten!AY11","v":49},{"$f":"Betriebsdaten!AZ11","v":50},{"$f":"Betriebsdaten!BA11","v":51},{"$f":"Betriebsdaten!BB11","v":52},{"$f":"Betriebsdaten!BC11","v":53},{"$f":"Betriebsdaten!BD11","v":54},{"$f":"Betriebsdaten!BE11","v":55},{"$f":"Betriebsdaten!BF11","v":56},{"$f":"Betriebsdaten!BG11","v":57},{"$f":"Betriebsdaten!BH11","v":58},{"$f":"Betriebsdaten!BI11","v":59},{"$f":"Betriebsdaten!BJ11","v":60},"€/gesamt"]
[null,"Frucht",{"$f":"Betriebsdaten!C15","v":"Spargel"},{"$f":"Betriebsdaten!D15","v":0},{"$f":"Betriebsdaten!E15","v":0},{"$f":"Betriebsdaten!F15","v":0},{"$f":"Betriebsdaten!G15","v":0},{"$f":"Betriebsdaten!H15","v":0},{"$f":"Betriebsdaten!I15","v":0},{"$f":"Betriebsdaten!J15","v":0},{"$f":"Betriebsdaten!K15","v":0},{"$f":"Betriebsdaten!L15","v":0},{"$f":"Betriebsdaten!M15","v":0},{"$f":"Betriebsdaten!N15","v":0},{"$f":"Betriebsdaten!O15","v":0},{"$f":"Betriebsdaten!P15","v":0},{"$f":"Betriebsdaten!Q15","v":0},{"$f":"Betriebsdaten!R15","v":0},{"$f":"Betriebsdaten!S15","v":0},{"$f":"Betriebsdaten!T15","v":0},{"$f":"Betriebsdaten!U15","v":0},{"$f":"Betriebsdaten!V15","v":0},{"$f":"Betriebsdaten!W15","v":0},{"$f":"Betriebsdaten!X15","v":0},{"$f":"Betriebsdaten!Y15","v":0},{"$f":"Betriebsdaten!Z15","v":0},{"$f":"Betriebsdaten!AA15","v":0},{"$f":"Betriebsdaten!AB15","v":0},{"$f":"Betriebsdaten!AC15","v":0},{"$f":"Betriebsdaten!AD15","v":0},{"$f":"Betriebsdaten!AE15","v":0},{"$f":"Betriebsdaten!AF15","v":0},{"$f":"Betriebsdaten!AG15","v":0},{"$f":"Betriebsdaten!AH15","v":0},{"$f":"Betriebsdaten!AI15","v":0},{"$f":"Betriebsdaten!AJ15","v":0},{"$f":"Betriebsdaten!AK15","v":0},{"$f":"Betriebsdaten!AL15","v":0},{"$f":"Betriebsdaten!AM15","v":0},{"$f":"Betriebsdaten!AN15","v":0},{"$f":"Betriebsdaten!AO15","v":0},{"$f":"Betriebsdaten!AP15","v":0},{"$f":"Betriebsdaten!AQ15","v":0},{"$f":"Betriebsdaten!AR15","v":0},{"$f":"Betriebsdaten!AS15","v":0},{"$f":"Betriebsdaten!AT15","v":0},{"$f":"Betriebsdaten!AU15","v":0},{"$f":"Betriebsdaten!AV15","v":0},{"$f":"Betriebsdaten!AW15","v":0},{"$f":"Betriebsdaten!AX15","v":0},{"$f":"Betriebsdaten!AY15","v":0},{"$f":"Betriebsdaten!AZ15","v":0},{"$f":"Betriebsdaten!BA15","v":0},{"$f":"Betriebsdaten!BB15","v":0},{"$f":"Betriebsdaten!BC15","v":0},{"$f":"Betriebsdaten!BD15","v":0},{"$f":"Betriebsdaten!BE15","v":0},{"$f":"Betriebsdaten!BF15","v":0},{"$f":"Betriebsdaten!BG15","v":0},{"$f":"Betriebsdaten!BH15","v":0},{"$f":"Betriebsdaten!BI15","v":0},{"$f":"Betriebsdaten!BJ15","v":0}]
[null,"Sorte",{"$f":"Betriebsdaten!C16","v":"Gijnlim"},{"$f":"Betriebsdaten!D16","v":0},{"$f":"Betriebsdaten!E16","v":0},{"$f":"Betriebsdaten!F16","v":0},{"$f":"Betriebsdaten!G16","v":0},{"$f":"Betriebsdaten!H16","v":0},{"$f":"Betriebsdaten!I16","v":0},{"$f":"Betriebsdaten!J16","v":0},{"$f":"Betriebsdaten!K16","v":0},{"$f":"Betriebsdaten!L16","v":0},{"$f":"Betriebsdaten!M16","v":0},{"$f":"Betriebsdaten!N16","v":0},{"$f":"Betriebsdaten!O16","v":0},{"$f":"Betriebsdaten!P16","v":0},{"$f":"Betriebsdaten!Q16","v":0},{"$f":"Betriebsdaten!R16","v":0},{"$f":"Betriebsdaten!S16","v":0},{"$f":"Betriebsdaten!T16","v":0},{"$f":"Betriebsdaten!U16","v":0},{"$f":"Betriebsdaten!V16","v":0},{"$f":"Betriebsdaten!W16","v":0},{"$f":"Betriebsdaten!X16","v":0},{"$f":"Betriebsdaten!Y16","v":0},{"$f":"Betriebsdaten!Z16","v":0},{"$f":"Betriebsdaten!AA16","v":0},{"$f":"Betriebsdaten!AB16","v":0},{"$f":"Betriebsdaten!AC16","v":0},{"$f":"Betriebsdaten!AD16","v":0},{"$f":"Betriebsdaten!AE16","v":0},{"$f":"Betriebsdaten!AF16","v":0},{"$f":"Betriebsdaten!AG16","v":0},{"$f":"Betriebsdaten!AH16","v":0},{"$f":"Betriebsdaten!AI16","v":0},{"$f":"Betriebsdaten!AJ16","v":0},{"$f":"Betriebsdaten!AK16","v":0},{"$f":"Betriebsdaten!AL16","v":0},{"$f":"Betriebsdaten!AM16","v":0},{"$f":"Betriebsdaten!AN16","v":0},{"$f":"Betriebsdaten!AO16","v":0},{"$f":"Betriebsdaten!AP16","v":0},{"$f":"Betriebsdaten!AQ16","v":0},{"$f":"Betriebsdaten!AR16","v":0},{"$f":"Betriebsdaten!AS16","v":0},{"$f":"Betriebsdaten!AT16","v":0},{"$f":"Betriebsdaten!AU16","v":0},{"$f":"Betriebsdaten!AV16","v":0},{"$f":"Betriebsdaten!AW16","v":0},{"$f":"Betriebsdaten!AX16","v":0},{"$f":"Betriebsdaten!AY16","v":0},{"$f":"Betriebsdaten!AZ16","v":0},{"$f":"Betriebsdaten!BA16","v":0},{"$f":"Betriebsdaten!BB16","v":0},{"$f":"Betriebsdaten!BC16","v":0},{"$f":"Betriebsdaten!BD16","v":0},{"$f":"Betriebsdaten!BE16","v":0},{"$f":"Betriebsdaten!BF16","v":0},{"$f":"Betriebsdaten!BG16","v":0},{"$f":"Betriebsdaten!BH16","v":0},{"$f":"Betriebsdaten!BI16","v":0},{"$f":"Betriebsdaten!BJ16","v":0}]
[null,"ha",{"$f":"Betriebsdaten!C17","v":3.8},{"$f":"Betriebsdaten!D17","v":0},{"$f":"Betriebsdaten!E17","v":0},{"$f":"Betriebsdaten!F17","v":0},{"$f":"Betriebsdaten!G17","v":0},{"$f":"Betriebsdaten!H17","v":0},{"$f":"Betriebsdaten!I17","v":0},{"$f":"Betriebsdaten!J17","v":0},{"$f":"Betriebsdaten!K17","v":0},{"$f":"Betriebsdaten!L17","v":0},{"$f":"Betriebsdaten!M17","v":0},{"$f":"Betriebsdaten!N17","v":0},{"$f":"Betriebsdaten!O17","v":0},{"$f":"Betriebsdaten!P17","v":0},{"$f":"Betriebsdaten!Q17","v":0},{"$f":"Betriebsdaten!R17","v":0},{"$f":"Betriebsdaten!S17","v":0},{"$f":"Betriebsdaten!T17","v":0},{"$f":"Betriebsdaten!U17","v":0},{"$f":"Betriebsdaten!V17","v":0},{"$f":"Betriebsdaten!W17","v":0},{"$f":"Betriebsdaten!X17","v":0},{"$f":"Betriebsdaten!Y17","v":0},{"$f":"Betriebsdaten!Z17","v":0},{"$f":"Betriebsdaten!AA17","v":0},{"$f":"Betriebsdaten!AB17","v":0},{"$f":"Betriebsdaten!AC17","v":0},{"$f":"Betriebsdaten!AD17","v":0},{"$f":"Betriebsdaten!AE17","v":0},{"$f":"Betriebsdaten!AF17","v":0},{"$f":"Betriebsdaten!AG17","v":0},{"$f":"Betriebsdaten!AH17","v":0},{"$f":"Betriebsdaten!AI17","v":0},{"$f":"Betriebsdaten!AJ17","v":0},{"$f":"Betriebsdaten!AK17","v":0},{"$f":"Betriebsdaten!AL17","v":0},{"$f":"Betriebsdaten!AM17","v":0},{"$f":"Betriebsdaten!AN17","v":0},{"$f":"Betriebsdaten!AO17","v":0},{"$f":"Betriebsdaten!AP17","v":0},{"$f":"Betriebsdaten!AQ17","v":0},{"$f":"Betriebsdaten!AR17","v":0},{"$f":"Betriebsdaten!AS17","v":0},{"$f":"Betriebsdaten!AT17","v":0},{"$f":"Betriebsdaten!AU17","v":0},{"$f":"Betriebsdaten!AV17","v":0},{"$f":"Betriebsdaten!AW17","v":0},{"$f":"Betriebsdaten!AX17","v":0},{"$f":"Betriebsdaten!AY17","v":0},{"$f":"Betriebsdaten!AZ17","v":0},{"$f":"Betriebsdaten!BA17","v":0},{"$f":"Betriebsdaten!BB17","v":0},{"$f":"Betriebsdaten!BC17","v":0},{"$f":"Betriebsdaten!BD17","v":0},{"$f":"Betriebsdaten!BE17","v":0},{"$f":"Betriebsdaten!BF17","v":0},{"$f":"Betriebsdaten!BG17","v":0},{"$f":"Betriebsdaten!BH17","v":0},{"$f":"Betriebsdaten!BI17","v":0},{"$f":"Betriebsdaten!BJ17","v":0},{"$f":"SUM(C6:AF6)","v":3.8}]
[null,{"$f":"IF(H2<>\"Große Dankbar\",\"Sie haben keine Lizenz für dieses Programm, bitte bestellen Sie eine Lizenz bei Herrn Große Dankbar\",\"\")","v":""}]
[null,"Gesamtertrag (Netto)",240,null,null,null,null,null,null,null,null,null,null,null,null,null,null,null,null,null,null,null,null,null,null,null,null,null,null,null,null,null,null,null,null,null,null,null,null,null,null,null,null,null,null,null,null,null,null,null,null,null,null,null,null,null,null,null,null,null,null,null,{"$f":"SUM(C8:BJ8)","v":240}]
[null,"Ertrag dt/ha (Netto)",{"$f":"IF(C8<0.1,0,(C8/C6))","v":63.15789473684211},{"$f":"IF(D8<0.1,0,(D8/D6))","v":0},0,0,0,0,0,0,0,0,0,0,0,0,0,0,0,0,0,0,0,0,0,0,0,0,0,0,0,0,{"$f":"IF(AG8<0.1,0,(AG8/AG6))","v":0},0,0,0,0,0,0,0,0,0,0,0,0,0,0,0,0,0,0,0,0,0,0,0,0,0,0,0,0,0]
[" x","Preis €/dt",445]
[" +","Prämie €/ha",350,null,null,null,null,null,null,null,null,null,null,null,null,null,null,null,null,null,null,null,null,null,null,null,null,null,null,null,null,null,null,null,null,null,null,null,null,null,null,null,null,null,null,null,null,null,null,null,null,null,null,null,null,null,null,null,null,null,null,null,{"$f":"(C11*$C$6)+(D11*$D$6)+(E11*$E$6)+(F11*$F$6)+(G11*$G$6)+(H11*$H$6)+(I11*$I$6)+(J11*$J$6)+(K11*$K$6)+(L11*$L$6)+(M11*$M$6)+(N11*$N$6)+(O11*$O$6)+(P11*$P$6)+(Q11*$Q$6)+(R11*$R$6)+(S11*$S$6)+(T11*$T$6)+(U11*$U$6)+(V11*$V$6)+(W11*$W$6)+(X11*$X$6)+(Y11*$Y$6)+(Z11*$Z$6)+(AA11*$AA$6)+(AB11*$AB$6)+(AC11*$AC$6)+(AD11*$AD$6)+(AE11*$AE$6)+(AF11*$AF$6)+(AG11*$AG$6)+(AH11*$AH$6)+(AI11*$AI$6)+(AJ11*$AJ$6)+(AK11*$AK$6)+(AL11*$AL$6)+(AM11*$AM$6)+(AN11*$AN$6)+(AO11*$AO$6)+(AP11*$AP$6)+(AQ11*$AQ$6)+(AR11*$AR$6)+(AS11*$AS$6)+(AT11*$AT$6)+(AU11*$AU$6)+(AV11*$AV$6)+(AW11*$AW$6)+(AX11*$AX$6)+(AY11*$AY$6)+(AZ11*$AZ$6)+(BA11*$BA$6)+(BB11*$BB$6)+(BC11*$BC$6)+(BD11*$BD$6)+(BE11*$BE$6)+(BF11*$BF$6)*(BG11*$BG$6)+(BH11*$BH$6)+(BI11*$BI$6)+(BJ11*$BJ$6)","v":1330}]
[" +","sonstige Einnahmen/ha",null,null,null,null,null,null,null,null,null,null,null,null,null,null,null,null,null,null,null,null,null,null,null,null,null,null,null,null,null,null,null,null,null,null,null,null,null,null,null,null,null,null,null,null,null,null,null,null,null,null,null,null,null,null,null,null,null,null,null,null,{"$f":"(C12*$C$6)+(D12*$D$6)+(E12*$E$6)+(F12*$F$6)+(G12*$G$6)+(H12*$H$6)+(I12*$I$6)+(J12*$J$6)+(K12*$K$6)+(L12*$L$6)+(M12*$M$6)+(N12*$N$6)+(O12*$O$6)+(P12*$P$6)+(Q12*$Q$6)+(R12*$R$6)+(S12*$S$6)+(T12*$T$6)+(U12*$U$6)+(V12*$V$6)+(W12*$W$6)+(X12*$X$6)+(Y12*$Y$6)+(Z12*$Z$6)+(AA12*$AA$6)+(AB12*$AB$6)+(AC12*$AC$6)+(AD12*$AD$6)+(AE12*$AE$6)+(AF12*$AF$6)+(AG12*$AG$6)+(AH12*$AH$6)+(AI12*$AI$6)+(AJ12*$AJ$6)+(AK12*$AK$6)+(AL12*$AL$6)+(AM12*$AM$6)+(AN12*$AN$6)+(AO12*$AO$6)+(AP12*$AP$6)+(AQ12*$AQ$6)+(AR12*$AR$6)+(AS12*$AS$6)+(AT12*$AT$6)+(AU12*$AU$6)+(AV12*$AV$6)+(AW12*$AW$6)+(AX12*$AX$6)+(AY12*$AY$6)+(AZ12*$AZ$6)+(BA12*$BA$6)+(BB12*$BB$6)+(BC12*$BC$6)+(BD12*$BD$6)+(BE12*$BE$6)+(BF12*$BF$6)*(BG12*$BG$6)+(BH12*$BH$6)+(BI12*$BI$6)+(BJ12*$BJ$6)","v":0}]
[" =","Marktleistung €/ha",{"$f":"IF($H$2<>\"Große Dankbar\",(C6*C10+C9+C15),(C9*C10)+C11+C12)","v":28455.26315789474},0,0,0,0,0,0,0,0,0,0,0,0,0,0,0,0,0,0,0,0,0,0,0,0,0,0,0,0,0,0,0,{"$f":"IF($H$2<>\"Große Dankbar\",(AI6*AI10+AI9+AI15),(AI9*AI10)+AI11+AI12)","v":0},0,0,0,0,0,0,0,0,0,0,0,0,0,0,0,0,0,0,0,0,0,0,0,0,0,0,0,{"$f":"(C13*$C$6)+(D13*$D$6)+(E13*$E$6)+(F13*$F$6)+(G13*$G$6)+(H13*$H$6)+(I13*$I$6)+(J13*$J$6)+(K13*$K$6)+(L13*$L$6)+(M13*$M$6)+(N13*$N$6)+(O13*$O$6)+(P13*$P$6)+(Q13*$Q$6)+(R13*$R$6)+(S13*$S$6)+(T13*$T$6)+(U13*$U$6)+(V13*$V$6)+(W13*$W$6)+(X13*$X$6)+(Y13*$Y$6)+(Z13*$Z$6)+(AA13*$AA$6)+(AB13*$AB$6)+(AC13*$AC$6)+(AD13*$AD$6)+(AE13*$AE$6)+(AF13*$AF$6)","v":108130.00000000001}]
[null,{"$f":"IF(H2<>\"Große Dankbar\",\"Falls Sie das Programm nicht schließen, treten unreperable Rechenfehler in Excel auf!!!\",\"\")","v":""}]
[" -","Saatgut €/ha",{"$f":"Saatgut!C13","v":826.66666666666663},{"$f":"Saatgut!D13","v":0},{"$f":"Saatgut!E13","v":0},{"$f":"Saatgut!F13","v":0},{"$f":"Saatgut!G13","v":0},{"$f":"Saatgut!H13","v":0},{"$f":"Saatgut!I13","v":0},{"$f":"Saatgut!J13","v":0},{"$f":"Saatgut!K13","v":0},{"$f":"Saatgut!L13","v":0},{"$f":"Saatgut!M13","v":0},{"$f":"Saatgut!N13","v":0},{"$f":"Saatgut!O13","v":0},{"$f":"Saatgut!P13","v":0},{"$f":"Saatgut!Q13","v":0},{"$f":"Saatgut!R13","v":0},{"$f":"Saatgut!S13","v":0},{"$f":"Saatgut!T13","v":0},{"$f":"Saatgut!U13","v":0},{"$f":"Saatgut!V13","v":0},{"$f":"Saatgut!W13","v":0},{"$f":"Saatgut!X13","v":0},{"$f":"Saatgut!Y13","v":0},{"$f":"Saatgut!Z13","v":0},{"$f":"Saatgut!AA13","v":0},{"$f":"Saatgut!AB13","v":0},{"$f":"Saatgut!AC13","v":0},{"$f":"Saatgut!AD13","v":0},{"$f":"Saatgut!AE13","v":0},{"$f":"Saatgut!AF13","v":0},{"$f":"Saatgut!AG13","v":0},{"$f":"Saatgut!AH13","v":0},{"$f":"Saatgut!AI13","v":0},{"$f":"Saatgut!AJ13","v":0},{"$f":"Saatgut!AK13","v":0},{"$f":"Saatgut!AL13","v":0},{"$f":"Saatgut!AM13","v":0},{"$f":"Saatgut!AN13","v":0},{"$f":"Saatgut!AO13","v":0},{"$f":"Saatgut!AP13","v":0},{"$f":"Saatgut!AQ13","v":0},{"$f":"Saatgut!AR13","v":0},{"$f":"Saatgut!AS13","v":0},{"$f":"Saatgut!AT13","v":0},{"$f":"Saatgut!AU13","v":0},{"$f":"Saatgut!AV13","v":0},{"$f":"Saatgut!AW13","v":0},{"$f":"Saatgut!AX13","v":0},{"$f":"Saatgut!AY13","v":0},{"$f":"Saatgut!AZ13","v":0},{"$f":"Saatgut!BA13","v":0},{"$f":"Saatgut!BB13","v":0},{"$f":"Saatgut!BC13","v":0},{"$f":"Saatgut!BD13","v":0},{"$f":"Saatgut!BE13","v":0},{"$f":"Saatgut!BF13","v":0},{"$f":"Saatgut!BG13","v":0},{"$f":"Saatgut!BH13","v":0},{"$f":"Saatgut!BI13","v":0},{"$f":"Saatgut!BJ13","v":0},{"$f":"(C15*$C$6)+(D15*$D$6)+(E15*$E$6)+(F15*$F$6)+(G15*$G$6)+(H15*$H$6)+(I15*$I$6)+(J15*$J$6)+(K15*$K$6)+(L15*$L$6)+(M15*$M$6)+(N15*$N$6)+(O15*$O$6)+(P15*$P$6)+(Q15*$Q$6)+(R15*$R$6)+(S15*$S$6)+(T15*$T$6)+(U15*$U$6)+(V15*$V$6)+(W15*$W$6)+(X15*$X$6)+(Y15*$Y$6)+(Z15*$Z$6)+(AA15*$AA$6)+(AB15*$AB$6)+(AC15*$AC$6)+(AD15*$AD$6)+(AE15*$AE$6)+(AF15*$AF$6)+(AG15*$AG$6)+(AH15*$AH$6)+(AI15*$AI$6)+(AJ15*$AJ$6)+(AK15*$AK$6)+(AL15*$AL$6)+(AM15*$AM$6)+(AN15*$AN$6)+(AO15*$AO$6)+(AP15*$AP$6)+(AQ15*$AQ$6)+(AR15*$AR$6)+(AS15*$AS$6)+(AT15*$AT$6)+(AU15*$AU$6)+(AV15*$AV$6)+(AW15*$AW$6)+(AX15*$AX$6)+(AY15*$AY$6)+(AZ15*$AZ$6)+(BA15*$BA$6)+(BB15*$BB$6)+(BC15*$BC$6)+(BD15*$BD$6)+(BE15*$BE$6)+(BF15*$BF$6)*(BG15*$BG$6)+(BH15*$BH$6)+(BI15*$BI$6)+(BJ15*$BJ$6)","v":3141.333333333333}]
[" -","Dünger €/ha",{"$f":"Düngung!C162","v":99.125},{"$f":"Düngung!D162","v":0},{"$f":"Düngung!E162","v":0},{"$f":"Düngung!F162","v":0},{"$f":"Düngung!G162","v":0},{"$f":"Düngung!H162","v":0},{"$f":"Düngung!I162","v":0},{"$f":"Düngung!J162","v":0},{"$f":"Düngung!K162","v":0},{"$f":"Düngung!L162","v":0},{"$f":"Düngung!M162","v":0},{"$f":"Düngung!N162","v":0},{"$f":"Düngung!O162","v":0},{"$f":"Düngung!P162","v":0},{"$f":"Düngung!Q162","v":0},{"$f":"Düngung!R162","v":0},{"$f":"Düngung!S162","v":0},{"$f":"Düngung!T162","v":0},{"$f":"Düngung!U162","v":0},{"$f":"Düngung!V162","v":0},{"$f":"Düngung!W162","v":0},{"$f":"Düngung!X162","v":0},{"$f":"Düngung!Y162","v":0},{"$f":"Düngung!Z162","v":0},{"$f":"Düngung!AA162","v":0},{"$f":"Düngung!AB162","v":0},{"$f":"Düngung!AC162","v":0},{"$f":"Düngung!AD162","v":0},{"$f":"Düngung!AE162","v":0},{"$f":"Düngung!AF162","v":0},{"$f":"Düngung!AG162","v":0},{"$f":"Düngung!AH162","v":0},{"$f":"Düngung!AI162","v":0},{"$f":"Düngung!AJ162","v":0},{"$f":"Düngung!AK162","v":0},{"$f":"Düngung!AL162","v":0},{"$f":"Düngung!AM162","v":0},{"$f":"Düngung!AN162","v":0},{"$f":"Düngung!AO162","v":0},{"$f":"Düngung!AP162","v":0},{"$f":"Düngung!AQ162","v":0},{"$f":"Düngung!AR162","v":0},{"$f":"Düngung!AS162","v":0},{"$f":"Düngung!AT162","v":0},{"$f":"Düngung!AU162","v":0},{"$f":"Düngung!AV162","v":0},{"$f":"Düngung!AW162","v":0},{"$f":"Düngung!AX162","v":0},{"$f":"Düngung!AY162","v":0},{"$f":"Düngung!AZ162","v":0},{"$f":"Düngung!BA162","v":0},{"$f":"Düngung!BB162","v":0},{"$f":"Düngung!BC162","v":0},{"$f":"Düngung!BD162","v":0},{"$f":"Düngung!BE162","v":0},{"$f":"Düngung!BF162","v":0},{"$f":"Düngung!BG162","v":0},{"$f":"Düngung!BH162","v":0},{"$f":"Düngung!BI162","v":0},{"$f":"Düngung!BJ162","v":0},376.67499999999995]
[" -","Pflanzenschutz €/ha",{"$f":"IF($H$2<>\"Große Dankbar\",C11+C10,PSM!C157)","v":238.26750000000001},{"$f":"IF($H$2<>\"Große Dankbar\",D11+D10,PSM!D157)","v":0},{"$f":"IF($H$2<>\"Große Dankbar\",E11+E10,PSM!E157)","v":0},{"$f":"IF($H$2<>\"Große Dankbar\",F11+F10,PSM!F157)","v":0},{"$f":"IF($H$2<>\"Große Dankbar\",G11+G10,PSM!G157)","v":0},{"$f":"IF($H$2<>\"Große Dankbar\",H11+H10,PSM!H157)","v":0},{"$f":"IF($H$2<>\"Große Dankbar\",I11+I10,PSM!I157)","v":0},{"$f":"IF($H$2<>\"Große Dankbar\",J11+J10,PSM!J157)","v":0},{"$f":"IF($H$2<>\"Große Dankbar\",K11+K10,PSM!K157)","v":0},{"$f":"IF($H$2<>\"Große Dankbar\",L11+L10,PSM!L157)","v":0},{"$f":"IF($H$2<>\"Große Dankbar\",M11+M10,PSM!M157)","v":0},{"$f":"IF($H$2<>\"Große Dankbar\",N11+N10,PSM!N157)","v":0},{"$f":"IF($H$2<>\"Große Dankbar\",O11+O10,PSM!O157)","v":0},{"$f":"IF($H$2<>\"Große Dankbar\",P11+P10,PSM!P157)","v":0},{"$f":"IF($H$2<>\"Große Dankbar\",Q11+Q10,PSM!Q157)","v":0},{"$f":"IF($H$2<>\"Große Dankbar\",R11+R10,PSM!R157)","v":0},{"$f":"IF($H$2<>\"Große Dankbar\",S11+S10,PSM!S157)","v":0},{"$f":"IF($H$2<>\"Große Dankbar\",T11+T10,PSM!T157)","v":0},{"$f":"IF($H$2<>\"Große Dankbar\",U11+U10,PSM!U157)","v":0},{"$f":"IF($H$2<>\"Große Dankbar\",V11+V10,PSM!V157)","v":0},{"$f":"IF($H$2<>\"Große Dankbar\",W11+W10,PSM!W157)","v":0},{"$f":"IF($H$2<>\"Große Dankbar\",X11+X10,PSM!X157)","v":0},{"$f":"IF($H$2<>\"Große Dankbar\",Y11+Y10,PSM!Y157)","v":0},{"$f":"IF($H$2<>\"Große Dankbar\",Z11+Z10,PSM!Z157)","v":0},{"$f":"IF($H$2<>\"Große Dankbar\",AA11+AA10,PSM!AA157)","v":0},{"$f":"IF($H$2<>\"Große Dankbar\",AB11+AB10,PSM!AB157)","v":0},{"$f":"IF($H$2<>\"Große Dankbar\",AC11+AC10,PSM!AC157)","v":0},{"$f":"IF($H$2<>\"Große Dankbar\",AD11+AD10,PSM!AD157)","v":0},{"$f":"IF($H$2<>\"Große Dankbar\",AE11+AE10,PSM!AE157)","v":0},{"$f":"IF($H$2<>\"Große Dankbar\",AF11+AF10,PSM!AF157)","v":0},{"$f":"IF($H$2<>\"Große Dankbar\",AG11+AG10,PSM!AG157)","v":0},{"$f":"IF($H$2<>\"Große Dankbar\",AH11+AH10,PSM!AH157)","v":0},{"$f":"IF($H$2<>\"Große Dankbar\",AI11+AI10,PSM!AI157)","v":0},{"$f":"IF($H$2<>\"Große Dankbar\",AJ11+AJ10,PSM!AJ157)","v":0},{"$f":"IF($H$2<>\"Große Dankbar\",AK11+AK10,PSM!AK157)","v":0},{"$f":"IF($H$2<>\"Große Dankbar\",AL11+AL10,PSM!AL157)","v":0},{"$f":"IF($H$2<>\"Große Dankbar\",AM11+AM10,PSM!AM157)","v":0},{"$f":"IF($H$2<>\"Große Dankbar\",AN11+AN10,PSM!AN157)","v":0},{"$f":"IF($H$2<>\"Große Dankbar\",AO11+AO10,PSM!AO157)","v":0},{"$f":"IF($H$2<>\"Große Dankbar\",AP11+AP10,PSM!AP157)","v":0},{"$f":"IF($H$2<>\"Große Dankbar\",AQ11+AQ10,PSM!AQ157)","v":0},{"$f":"IF($H$2<>\"Große Dankbar\",AR11+AR10,PSM!AR157)","v":0},{"$f":"IF($H$2<>\"Große Dankbar\",AS11+AS10,PSM!AS157)","v":0},{"$f":"IF($H$2<>\"Große Dankbar\",AT11+AT10,PSM!AT157)","v":0},{"$f":"IF($H$2<>\"Große Dankbar\",AU11+AU10,PSM!AU157)","v":0},{"$f":"IF($H$2<>\"Große Dankbar\",AV11+AV10,PSM!AV157)","v":0},{"$f":"IF($H$2<>\"Große Dankbar\",AW11+AW10,PSM!AW157)","v":0},{"$f":"IF($H$2<>\"Große Dankbar\",AX11+AX10,PSM!AX157)","v":0},{"$f":"IF($H$2<>\"Große Dankbar\",AY11+AY10,PSM!AY157)","v":0},{"$f":"IF($H$2<>\"Große Dankbar\",AZ11+AZ10,PSM!AZ157)","v":0},{"$f":"IF($H$2<>\"Große Dankbar\",BA11+BA10,PSM!BA157)","v":0},{"$f":"IF($H$2<>\"Große Dankbar\",BB11+BB10,PSM!BB157)","v":0},{"$f":"IF($H$2<>\"Große Dankbar\",BC11+BC10,PSM!BC157)","v":0},{"$f":"IF($H$2<>\"Große Dankbar\",BD11+BD10,PSM!BD157)","v":0},{"$f":"IF($H$2<>\"Große Dankbar\",BE11+BE10,PSM!BE157)","v":0},{"$f":"IF($H$2<>\"Große Dankbar\",BF11+BF10,PSM!BF157)","v":0},{"$f":"IF($H$2<>\"Große Dankbar\",BG11+BG10,PSM!BG157)","v":0},{"$f":"IF($H$2<>\"Große Dankbar\",BH11+BH10,PSM!BH157)","v":0},{"$f":"IF($H$2<>\"Große Dankbar\",BI11+BI10,PSM!BI157)","v":0},{"$f":"IF($H$2<>\"Große Dankbar\",BJ11+BJ10,PSM!BJ157)","v":0},905.41650000000004]
[" -","Kosten Ackerbau €/ha",{"$f":"Maschinen!C71","v":1448.5},{"$f":"Maschinen!D71","v":0},{"$f":"Maschinen!E71","v":0},{"$f":"Maschinen!F71","v":0},{"$f":"Maschinen!G71","v":0},{"$f":"Maschinen!H71","v":0},{"$f":"Maschinen!I71","v":0},{"$f":"Maschinen!J71","v":0},{"$f":"Maschinen!K71","v":0},{"$f":"Maschinen!L71","v":0},{"$f":"Maschinen!M71","v":0},{"$f":"Maschinen!N71","v":0},{"$f":"Maschinen!O71","v":0},{"$f":"Maschinen!P71","v":0},{"$f":"Maschinen!Q71","v":0},{"$f":"Maschinen!R71","v":0},{"$f":"Maschinen!S71","v":0},{"$f":"Maschinen!T71","v":0},{"$f":"Maschinen!U71","v":0},{"$f":"Maschinen!V71","v":0},{"$f":"Maschinen!W71","v":0},{"$f":"Maschinen!X71","v":0},{"$f":"Maschinen!Y71","v":0},{"$f":"Maschinen!Z71","v":0},{"$f":"Maschinen!AA71","v":0},{"$f":"Maschinen!AB71","v":0},{"$f":"Maschinen!AC71","v":0},{"$f":"Maschinen!AD71","v":0},{"$f":"Maschinen!AE71","v":0},{"$f":"Maschinen!AF71","v":0},{"$f":"Maschinen!AG71","v":0},{"$f":"Maschinen!AH71","v":0},{"$f":"Maschinen!AI71","v":0},{"$f":"Maschinen!AJ71","v":0},{"$f":"Maschinen!AK71","v":0},{"$f":"Maschinen!AL71","v":0},{"$f":"Maschinen!AM71","v":0},{"$f":"Maschinen!AN71","v":0},{"$f":"Maschinen!AO71","v":0},{"$f":"Maschinen!AP71","v":0},{"$f":"Maschinen!AQ71","v":0},{"$f":"Maschinen!AR71","v":0},{"$f":"Maschinen!AS71","v":0},{"$f":"Maschinen!AT71","v":0},{"$f":"Maschinen!AU71","v":0},{"$f":"Maschinen!AV71","v":0},{"$f":"Maschinen!AW71","v":0},{"$f":"Maschinen!AX71","v":0},{"$f":"Maschinen!AY71","v":0},{"$f":"Maschinen!AZ71","v":0},{"$f":"Maschinen!BA71","v":0},{"$f":"Maschinen!BB71","v":0},{"$f":"Maschinen!BC71","v":0},{"$f":"Maschinen!BD71","v":0},{"$f":"Maschinen!BE71","v":0},{"$f":"Maschinen!BF71","v":0},{"$f":"Maschinen!BG71","v":0},{"$f":"Maschinen!BH71","v":0},{"$f":"Maschinen!BI71","v":0},{"$f":"Maschinen!BJ71","v":0},5504.3]
[null,"davon Lohnuntern./ha",{"$f":"Maschinen!C68","v":520},{"$f":"Maschinen!D68","v":0},{"$f":"Maschinen!E68","v":0},{"$f":"Maschinen!F68","v":0},{"$f":"Maschinen!G68","v":0},{"$f":"Maschinen!H68","v":0},{"$f":"Maschinen!I68","v":0},{"$f":"Maschinen!J68","v":0},{"$f":"Maschinen!K68","v":0},{"$f":"Maschinen!L68","v":0},{"$f":"Maschinen!M68","v":0},{"$f":"Maschinen!N68","v":0},{"$f":"Maschinen!O68","v":0},{"$f":"Maschinen!P68","v":0},{"$f":"Maschinen!Q68","v":0},{"$f":"Maschinen!R68","v":0},{"$f":"Maschinen!S68","v":0},{"$f":"Maschinen!T68","v":0},{"$f":"Maschinen!U68","v":0},{"$f":"Maschinen!V68","v":0},{"$f":"Maschinen!W68","v":0},{"$f":"Maschinen!X68","v":0},{"$f":"Maschinen!Y68","v":0},{"$f":"Maschinen!Z68","v":0},{"$f":"Maschinen!AA68","v":0},{"$f":"Maschinen!AB68","v":0},{"$f":"Maschinen!AC68","v":0},{"$f":"Maschinen!AD68","v":0},{"$f":"Maschinen!AE68","v":0},{"$f":"Maschinen!AF68","v":0},{"$f":"Maschinen!AG68","v":0},{"$f":"Maschinen!AH68","v":0},{"$f":"Maschinen!AI68","v":0},{"$f":"Maschinen!AJ68","v":0},{"$f":"Maschinen!AK68","v":0},{"$f":"Maschinen!AL68","v":0},{"$f":"Maschinen!AM68","v":0},{"$f":"Maschinen!AN68","v":0},{"$f":"Maschinen!AO68","v":0},{"$f":"Maschinen!AP68","v":0},{"$f":"Maschinen!AQ68","v":0},{"$f":"Maschinen!AR68","v":0},{"$f":"Maschinen!AS68","v":0},{"$f":"Maschinen!AT68","v":0},{"$f":"Maschinen!AU68","v":0},{"$f":"Maschinen!AV68","v":0},{"$f":"Maschinen!AW68","v":0},{"$f":"Maschinen!AX68","v":0},{"$f":"Maschinen!AY68","v":0},{"$f":"Maschinen!AZ68","v":0},{"$f":"Maschinen!BA68","v":0},{"$f":"Maschinen!BB68","v":0},{"$f":"Maschinen!BC68","v":0},{"$f":"Maschinen!BD68","v":0},{"$f":"Maschinen!BE68","v":0},{"$f":"Maschinen!BF68","v":0},{"$f":"Maschinen!BG68","v":0},{"$f":"Maschinen!BH68","v":0},{"$f":"Maschinen!BI68","v":0},{"$f":"Maschinen!BJ68","v":0},1976]
[null,"Lohnkosten €/ha",{"$f":"IF($H$2<>\"Große Dankbar\",C16+C21/4,Arbeitskräfte!C28)","v":13780},{"$f":"IF($H$2<>\"Große Dankbar\",D16+D21/4,Arbeitskräfte!D28)","v":0},{"$f":"IF($H$2<>\"Große Dankbar\",E16+E21/4,Arbeitskräfte!E28)","v":0},{"$f":"IF($H$2<>\"Große Dankbar\",F16+F21/4,Arbeitskräfte!F28)","v":0},{"$f":"IF($H$2<>\"Große Dankbar\",G16+G21/4,Arbeitskräfte!G28)","v":0},{"$f":"IF($H$2<>\"Große Dankbar\",H16+H21/4,Arbeitskräfte!H28)","v":0},{"$f":"IF($H$2<>\"Große Dankbar\",I16+I21/4,Arbeitskräfte!I28)","v":0},{"$f":"IF($H$2<>\"Große Dankbar\",J16+J21/4,Arbeitskräfte!J28)","v":0},{"$f":"IF($H$2<>\"Große Dankbar\",K16+K21/4,Arbeitskräfte!K28)","v":0},{"$f":"IF($H$2<>\"Große Dankbar\",L16+L21/4,Arbeitskräfte!L28)","v":0},{"$f":"IF($H$2<>\"Große Dankbar\",M16+M21/4,Arbeitskräfte!M28)","v":0},{"$f":"IF($H$2<>\"Große Dankbar\",N16+N21/4,Arbeitskräfte!N28)","v":0},{"$f":"IF($H$2<>\"Große Dankbar\",O16+O21/4,Arbeitskräfte!O28)","v":0},{"$f":"IF($H$2<>\"Große Dankbar\",P16+P21/4,Arbeitskräfte!P28)","v":0},{"$f":"IF($H$2<>\"Große Dankbar\",Q16+Q21/4,Arbeitskräfte!Q28)","v":0},{"$f":"IF($H$2<>\"Große Dankbar\",R16+R21/4,Arbeitskräfte!R28)","v":0},{"$f":"IF($H$2<>\"Große Dankbar\",S16+S21/4,Arbeitskräfte!S28)","v":0},{"$f":"IF($H$2<>\"Große Dankbar\",T16+T21/4,Arbeitskräfte!T28)","v":0},{"$f":"IF($H$2<>\"Große Dankbar\",U16+U21/4,Arbeitskräfte!U28)","v":0},{"$f":"IF($H$2<>\"Große Dankbar\",V16+V21/4,Arbeitskräfte!V28)","v":0},{"$f":"IF($H$2<>\"Große Dankbar\",W16+W21/4,Arbeitskräfte!W28)","v":0},{"$f":"IF($H$2<>\"Große Dankbar\",X16+X21/4,Arbeitskräfte!X28)","v":0},{"$f":"IF($H$2<>\"Große Dankbar\",Y16+Y21/4,Arbeitskräfte!Y28)","v":0},{"$f":"IF($H$2<>\"Große Dankbar\",Z16+Z21/4,Arbeitskräfte!Z28)","v":0},{"$f":"IF($H$2<>\"Große Dankbar\",AA16+AA21/4,Arbeitskräfte!AA28)","v":0},{"$f":"IF($H$2<>\"Große Dankbar\",AB16+AB21/4,Arbeitskräfte!AB28)","v":0},{"$f":"IF($H$2<>\"Große Dankbar\",AC16+AC21/4,Arbeitskräfte!AC28)","v":0},{"$f":"IF($H$2<>\"Große Dankbar\",AD16+AD21/4,Arbeitskräfte!AD28)","v":0},{"$f":"IF($H$2<>\"Große Dankbar\",AE16+AE21/4,Arbeitskräfte!AE28)","v":0},{"$f":"IF($H$2<>\"Große Dankbar\",AF16+AF21/4,Arbeitskräfte!AF28)","v":0},{"$f":"IF($H$2<>\"Große Dankbar\",AG16+AG21/4,Arbeitskräfte!AG28)","v":0},{"$f":"IF($H$2<>\"Große Dankbar\",AH16+AH21/4,Arbeitskräfte!AH28)","v":0},{"$f":"IF($H$2<>\"Große Dankbar\",AI16+AI21/4,Arbeitskräfte!AI28)","v":0},{"$f":"IF($H$2<>\"Große Dankbar\",AJ16+AJ21/4,Arbeitskräfte!AJ28)","v":0},{"$f":"IF($H$2<>\"Große Dankbar\",AK16+AK21/4,Arbeitskräfte!AK28)","v":0},{"$f":"IF($H$2<>\"Große Dankbar\",AL16+AL21/4,Arbeitskräfte!AL28)","v":0},{"$f":"IF($H$2<>\"Große Dankbar\",AM16+AM21/4,Arbeitskräfte!AM28)","v":0},{"$f":"IF($H$2<>\"Große Dankbar\",AN16+AN21/4,Arbeitskräfte!AN28)","v":0},{"$f":"IF($H$2<>\"Große Dankbar\",AO16+AO21/4,Arbeitskräfte!AO28)","v":0},{"$f":"IF($H$2<>\"Große Dankbar\",AP16+AP21/4,Arbeitskräfte!AP28)","v":0},{"$f":"IF($H$2<>\"Große Dankbar\",AQ16+AQ21/4,Arbeitskräfte!AQ28)","v":0},{"$f":"IF($H$2<>\"Große Dankbar\",AR16+AR21/4,Arbeitskräfte!AR28)","v":0},{"$f":"IF($H$2<>\"Große Dankbar\",AS16+AS21/4,Arbeitskräfte!AS28)","v":0},{"$f":"IF($H$2<>\"Große Dankbar\",AT16+AT21/4,Arbeitskräfte!AT28)","v":0},{"$f":"IF($H$2<>\"Große Dankbar\",AU16+AU21/4,Arbeitskräfte!AU28)","v":0},{"$f":"IF($H$2<>\"Große Dankbar\",AV16+AV21/4,Arbeitskräfte!AV28)","v":0},{"$f":"IF($H$2<>\"Große Dankbar\",AW16+AW21/4,Arbeitskräfte!AW28)","v":0},{"$f":"IF($H$2<>\"Große Dankbar\",AX16+AX21/4,Arbeitskräfte!AX28)","v":0},{"$f":"IF($H$2<>\"Große Dankbar\",AY16+AY21/4,Arbeitskräfte!AY28)","v":0},{"$f":"IF($H$2<>\"Große Dankbar\",AZ16+AZ21/4,Arbeitskräfte!AZ28)","v":0},{"$f":"IF($H$2<>\"Große Dankbar\",BA16+BA21/4,Arbeitskräfte!BA28)","v":0},{"$f":"IF($H$2<>\"Große Dankbar\",BB16+BB21/4,Arbeitskräfte!BB28)","v":0},{"$f":"IF($H$2<>\"Große Dankbar\",BC16+BC21/4,Arbeitskräfte!BC28)","v":0},{"$f":"IF($H$2<>\"Große Dankbar\",BD16+BD21/4,Arbeitskräfte!BD28)","v":0},{"$f":"IF($H$2<>\"Große Dankbar\",BE16+BE21/4,Arbeitskräfte!BE28)","v":0},{"$f":"IF($H$2<>\"Große Dankbar\",BF16+BF21/4,Arbeitskräfte!BF28)","v":0},{"$f":"IF($H$2<>\"Große Dankbar\",BG16+BG21/4,Arbeitskräfte!BG28)","v":0},{"$f":"IF($H$2<>\"Große Dankbar\",BH16+BH21/4,Arbeitskräfte!BH28)","v":0},{"$f":"IF($H$2<>\"Große Dankbar\",BI16+BI21/4,Arbeitskräfte!BI28)","v":0},{"$f":"IF($H$2<>\"Große Dankbar\",BJ16+BJ21/4,Arbeitskräfte!BJ28)","v":0},52364]
[null,"Materialkosten €/ha",{"$f":"Arbeitskräfte!C55","v":1686.01},{"$f":"Arbeitskräfte!D55","v":0},{"$f":"Arbeitskräfte!E55","v":0},{"$f":"Arbeitskräfte!F55","v":0},{"$f":"Arbeitskräfte!G55","v":0},{"$f":"Arbeitskräfte!H55","v":0},{"$f":"Arbeitskräfte!I55","v":0},{"$f":"Arbeitskräfte!J55","v":0},{"$f":"Arbeitskräfte!K55","v":0},{"$f":"Arbeitskräfte!L55","v":0},{"$f":"Arbeitskräfte!M55","v":0},{"$f":"Arbeitskräfte!N55","v":0},{"$f":"Arbeitskräfte!O55","v":0},{"$f":"Arbeitskräfte!P55","v":0},{"$f":"Arbeitskräfte!Q55","v":0},{"$f":"Arbeitskräfte!R55","v":0},{"$f":"Arbeitskräfte!S55","v":0},{"$f":"Arbeitskräfte!T55","v":0},{"$f":"Arbeitskräfte!U55","v":0},{"$f":"Arbeitskräfte!V55","v":0},{"$f":"Arbeitskräfte!W55","v":0},{"$f":"Arbeitskräfte!X55","v":0},{"$f":"Arbeitskräfte!Y55","v":0},{"$f":"Arbeitskräfte!Z55","v":0},{"$f":"Arbeitskräfte!AA55","v":0},{"$f":"Arbeitskräfte!AB55","v":0},{"$f":"Arbeitskräfte!AC55","v":0},{"$f":"Arbeitskräfte!AD55","v":0},{"$f":"Arbeitskräfte!AE55","v":0},{"$f":"Arbeitskräfte!AF55","v":0},{"$f":"Arbeitskräfte!AG55","v":0},{"$f":"Arbeitskräfte!AH55","v":0},{"$f":"Arbeitskräfte!AI55","v":0},{"$f":"Arbeitskräfte!AJ55","v":0},{"$f":"Arbeitskräfte!AK55","v":0},{"$f":"Arbeitskräfte!AL55","v":0},{"$f":"Arbeitskräfte!AM55","v":0},{"$f":"Arbeitskräfte!AN55","v":0},{"$f":"Arbeitskräfte!AO55","v":0},{"$f":"Arbeitskräfte!AP55","v":0},{"$f":"Arbeitskräfte!AQ55","v":0},{"$f":"Arbeitskräfte!AR55","v":0},{"$f":"Arbeitskräfte!AS55","v":0},{"$f":"Arbeitskräfte!AT55","v":0},{"$f":"Arbeitskräfte!AU55","v":0},{"$f":"Arbeitskräfte!AV55","v":0},{"$f":"Arbeitskräfte!AW55","v":0},{"$f":"Arbeitskräfte!AX55","v":0},{"$f":"Arbeitskräfte!AY55","v":0},{"$f":"Arbeitskräfte!AZ55","v":0},{"$f":"Arbeitskräfte!BA55","v":0},{"$f":"Arbeitskräfte!BB55","v":0},{"$f":"Arbeitskräfte!BC55","v":0},{"$f":"Arbeitskräfte!BD55","v":0},{"$f":"Arbeitskräfte!BE55","v":0},{"$f":"Arbeitskräfte!BF55","v":0},{"$f":"Arbeitskräfte!BG55","v":0},{"$f":"Arbeitskräfte!BH55","v":0},{"$f":"Arbeitskräfte!BI55","v":0},{"$f":"Arbeitskräfte!BJ55","v":0},6406.8379999999997]
[" -","sonst. var. Kosten €/ha",{"$f":"Arbeitskräfte!C76","v":3468},{"$f":"Arbeitskräfte!D76","v":0},{"$f":"Arbeitskräfte!E76","v":0},{"$f":"Arbeitskräfte!F76","v":0},{"$f":"Arbeitskräfte!G76","v":0},{"$f":"Arbeitskräfte!H76","v":0},{"$f":"Arbeitskräfte!I76","v":0},{"$f":"Arbeitskräfte!J76","v":0},{"$f":"Arbeitskräfte!K76","v":0},{"$f":"Arbeitskräfte!L76","v":0},{"$f":"Arbeitskräfte!M76","v":0},{"$f":"Arbeitskräfte!N76","v":0},{"$f":"Arbeitskräfte!O76","v":0},{"$f":"Arbeitskräfte!P76","v":0},{"$f":"Arbeitskräfte!Q76","v":0},{"$f":"Arbeitskräfte!R76","v":0},{"$f":"Arbeitskräfte!S76","v":0},{"$f":"Arbeitskräfte!T76","v":0},{"$f":"Arbeitskräfte!U76","v":0},{"$f":"Arbeitskräfte!V76","v":0},{"$f":"Arbeitskräfte!W76","v":0},{"$f":"Arbeitskräfte!X76","v":0},{"$f":"Arbeitskräfte!Y76","v":0},{"$f":"Arbeitskräfte!Z76","v":0},{"$f":"Arbeitskräfte!AA76","v":0},{"$f":"Arbeitskräfte!AB76","v":0},{"$f":"Arbeitskräfte!AC76","v":0},{"$f":"Arbeitskräfte!AD76","v":0},{"$f":"Arbeitskräfte!AE76","v":0},{"$f":"Arbeitskräfte!AF76","v":0},{"$f":"Arbeitskräfte!AG76","v":0},{"$f":"Arbeitskräfte!AH76","v":0},{"$f":"Arbeitskräfte!AI76","v":0},{"$f":"Arbeitskräfte!AJ76","v":0},{"$f":"Arbeitskräfte!AK76","v":0},{"$f":"Arbeitskräfte!AL76","v":0},{"$f":"Arbeitskräfte!AM76","v":0},{"$f":"Arbeitskräfte!AN76","v":0},{"$f":"Arbeitskräfte!AO76","v":0},{"$f":"Arbeitskräfte!AP76","v":0},{"$f":"Arbeitskräfte!AQ76","v":0},{"$f":"Arbeitskräfte!AR76","v":0},{"$f":"Arbeitskräfte!AS76","v":0},{"$f":"Arbeitskräfte!AT76","v":0},{"$f":"Arbeitskräfte!AU76","v":0},{"$f":"Arbeitskräfte!AV76","v":0},{"$f":"Arbeitskräfte!AW76","v":0},{"$f":"Arbeitskräfte!AX76","v":0},{"$f":"Arbeitskräfte!AY76","v":0},{"$f":"Arbeitskräfte!AZ76","v":0},{"$f":"Arbeitskräfte!BA76","v":0},{"$f":"Arbeitskräfte!BB76","v":0},{"$f":"Arbeitskräfte!BC76","v":0},{"$f":"Arbeitskräfte!BD76","v":0},{"$f":"Arbeitskräfte!BE76","v":0},{"$f":"Arbeitskräfte!BF76","v":0},{"$f":"Arbeitskräfte!BG76","v":0},{"$f":"Arbeitskräfte!BH76","v":0},{"$f":"Arbeitskräfte!BI76","v":0},{"$f":"Arbeitskräfte!BJ76","v":0},13178.4]
[" -",null,null,null,null,null,null,null,null,null,null,null,null,null,null,null,null,null,null,null,null,null,null,null,null,null,null,null,null,null,null,null,null,null,null,null,null,null,null,null,null,null,null,null,null,null,null,null,null,null,null,null,null,null,null,null,null,null,null,null,null,null,0]
[]
[null,"Summe Direktkosten",{"$f":"SUM(C15:C18)+SUM(C20:C23)","v":21546.569166666668},{"$f":"SUM(D15:D18)+SUM(D20:D23)","v":0},{"$f":"SUM(E15:E18)+SUM(E20:E23)","v":0},0,0,0,0,0,0,0,0,0,0,0,0,0,0,0,0,0,0,0,0,0,0,0,0,0,0,0,{"$f":"SUM(AG15:AG18)+SUM(AG20:AG23)","v":0},0,0,0,0,0,0,0,0,0,0,0,0,0,0,0,0,0,0,0,0,0,0,0,0,0,0,0,0,0,81876.962833333338]
[]
[" =","Deckungsbeitrag l /ha",{"$f":"C13-C25","v":6908.6939912280723},{"$f":"D13-D25","v":0},0,0,0,0,0,0,0,0,0,0,0,0,0,0,0,0,0,0,{"$f":"W13-W25","v":0},0,0,0,0,0,0,0,0,0,{"$f":"AG13-AG25","v":0},0,0,0,0,0,0,0,0,0,0,0,0,0,0,0,0,0,0,0,0,0,0,0,0,0,0,0,0,0,26253.037166666672]
[]
[" -","Festkosten/ha",3250,null,null,null,null,null,null,null,null,null,null,null,null,null,null,null,null,null,null,null,null,null,null,null,null,null,null,null,null,null,null,null,null,null,null,null,null,null,null,null,null,null,null,null,null,null,null,null,null,null,null,null,null,null,null,null,null,null,null,null,12350]
[" -",null,null,null,null,null,null,null,null,null,null,null,null,null,null,null,null,null,null,null,null,null,null,null,null,null,null,null,null,null,null,null,null,null,null,null,null,null,null,null,null,null,null,null,null,null,null,null,null,null,null,null,null,null,null,null,null,null,null,null,null,null,0]
[" =","Deckungsbeitrag ll /ha",{"$f":"C27-C29-C30","v":3658.6939912280723},{"$f":"D27-D29-D30","v":0},0,0,0,0,0,0,0,0,0,0,0,0,0,0,0,0,0,0,{"$f":"W27-W29-W30","v":0},0,0,0,0,0,0,0,0,0,{"$f":"AG27-AG29-AG30","v":0},0,0,0,0,0,0,0,0,0,0,0,0,0,0,0,0,0,0,0,0,0,0,0,0,0,0,0,0,0,13903.037166666674]
[]
[" -","Lohnansatz/ha",1200,null,null,null,null,null,null,null,null,null,null,null,null,null,null,null,null,null,null,null,null,null,null,null,null,null,null,null,null,null,null,null,null,null,null,null,null,null,null,null,null,null,null,null,null,null,null,null,null,null,null,null,null,null,null,null,null,null,null,null,4560]
[" -","Pachtansatz/ha",1200,null,null,null,null,null,null,null,null,null,null,null,null,null,null,null,null,null,null,null,null,null,null,null,null,null,null,null,null,null,null,null,null,null,null,null,null,null,null,null,null,null,null,null,null,null,null,null,null,null,null,null,null,null,null,null,null,null,null,null,4560]
[" -","Zinsansatz/ha",null,null,null,null,null,null,null,null,null,null,null,null,null,null,null,null,null,null,null,null,null,null,null,null,null,null,null,null,null,null,null,null,null,null,null,null,null,null,null,null,null,null,null,null,null,null,null,null,null,null,null,null,null,null,null,null,null,null,null,null,0]
[" -",null,null,null,null,null,null,null,null,null,null,null,null,null,null,null,null,null,null,null,null,null,null,null,null,null,null,null,null,null,null,null,null,null,null,null,null,null,null,null,null,null,null,null,null,null,null,null,null,null,null,null,null,null,null,null,null,null,null,null,null,null,0]
[" =","Unternehmergewinn/ha",{"$f":"C31-C33-C34-C35-C36","v":1258.6939912280723},{"$f":"D31-D33-D34-D35-D36","v":0},0,0,0,0,0,0,0,0,0,0,0,0,0,0,0,0,0,0,{"$f":"W31-W33-W34-W35-W36","v":0},0,0,0,0,0,0,0,0,0,{"$f":"AG31-AG33-AG34-AG35-AG36","v":0},0,0,0,0,0,0,0,0,0,0,0,0,0,0,0,0,0,0,0,0,0,0,0,0,0,0,0,0,0,4783.0371666666742]
[]
[null,"Leistung €/gesamt",{"$f":"C13*C6","v":108130.00000000001},{"$f":"D13*D6","v":0},0,0,0,0,0,0,0,0,0,0,0,0,0,0,0,0,0,0,{"$f":"W13*W6","v":0},0,0,0,0,0,0,0,0,0,{"$f":"AG13*AG6","v":0},0,0,0,0,0,0,0,0,0,0,0,0,0,0,0,0,0,0,0,0,0,0,0,0,0,0,0,0,0,{"$f":"SUM(C39:BJ39)","v":108130.00000000001}]
[" -","Kosten €/gesamt",{"$f":"(C15+C16+C17+C18+C20+C21+C22+C23+C29+C30)*C6","v":94226.962833333324},{"$f":"(D15+D16+D17+D18+D20+D21+D22+D23+D29+D30)*D6","v":0},0,0,0,0,0,0,0,0,0,0,0,0,0,0,0,0,0,0,{"$f":"(W15+W16+W17+W18+W22+W23+W29+W30)*W6","v":0},0,0,0,0,0,0,0,0,0,{"$f":"(AG15+AG16+AG17+AG18+AG22+AG23+AG29+AG30)*AG6","v":0},0,0,0,0,0,0,0,0,0,0,0,0,0,0,0,0,0,0,0,0,0,0,0,0,0,0,0,0,0,{"$f":"SUM(C40:BJ40)","v":94226.962833333324}]
[" =","Gewinn €/gesamt",{"$f":"C39-C40","v":13903.037166666691},{"$f":"D39-D40","v":0},0,0,0,0,0,0,0,0,0,0,0,0,0,0,0,0,0,0,{"$f":"W39-W40","v":0},0,0,0,0,0,0,0,0,0,{"$f":"AG39-AG40","v":0},0,0,0,0,0,0,0,0,0,0,0,0,0,0,0,0,0,0,0,0,0,0,0,0,0,0,0,0,0,{"$f":"SUM(C41:BJ41)","v":13903.037166666691}]
[null,"Unternehmergewinn",{"$f":"C37*C6","v":4783.0371666666742},{"$f":"D37*D6","v":0},0,0,0,0,0,0,0,0,0,0,0,0,0,0,0,0,0,0,{"$f":"W37*W6","v":0},0,0,0,0,0,0,0,0,0,{"$f":"AG37*AG6","v":0},0,0,0,0,0,0,0,0,0,0,0,0,0,0,0,0,0,0,0,0,0,0,0,0,0,0,0,0,0,{"$f":"SUM(C42:AF42)","v":4783.0371666666742}]
[]
[null,"Direktkosten pro kg ",{"$f":"IF(C9=0,0,(C25/(C9*100)))","v":3.4115401180555556},{"$f":"IF(D9=0,0,(D25/(D9*100)))","v":0},0,0,0,0,0,0,0,0,0,0,0,0,0,0,0,0,0,0,0,0,0,0,0,0,0,0,0,0,{"$f":"IF(AG9=0,0,(AG25/(AG9*100)))","v":0},0,0,0,0,0,0,0,0,0,0,0,0,0,0,0,0,0,0,0,0,0,0,0,0,0,0,0,0,0,{"$f":"BK25/BK8/100","v":3.4115401180555556}]
[null,"Gesamtosten pro kg ",{"$f":"IF(C9=0,0,(C25+C29+C30+C33+C34+C35+C36)/(C9*100))","v":4.3061234513888893},{"$f":"IF(D9=0,0,(D25+D29+D30+D33+D34+D35+D36)/(D9*100))","v":0},0,0,0,0,0,0,0,0,0,0,0,0,0,0,0,0,0,0,0,0,0,0,0,0,0,0,0,0,0,0,0,0,0,0,0,0,0,0,0,0,0,0,0,0,0,0,0,0,0,0,0,0,0,0,0,0,0,0,{"$f":"BK40/BK8/100","v":3.9261234513888881}]

{"sheet":"Betriebsdaten","index":9,"n_rows":48,"n_cols":63,"rows_kept":48,"cut":false,"hidden":false,"merged":[]}
[]
[null,null,"Betriebsdaten"]
[null,null,"Angaben zum Betrieb",null,null,null,null,"Erntejahr  :                             ",null,null,null,"2019"]
[null,null,"Name:  ","Große Dankbar",null,null,null,"LF:",25,"ha","davon"]
[null,null,"Straße:",null,null,null,null,"Acker",null,null,25,"ha"]
[null,null,"Plz./Ort: ",null,null,null,null,"Stilllegung",null,{"$f":"K5*I6/100","v":0},null,"ha"]
[null,"Flächen:","Tel/Fax: ",null,null,null,null,"Grünland",null,null,null,"ha"]
[]
[null,null,null,null,null,null,null,null,null,null,{"$f":"IF(K5+K6+K7<>I4,\"Fläche paßt nicht\",\"\")","v":""}]
[null,"Schlag Nr.",1,2,3,4,5,6,7,8,9,10,11,12,13,14,15,16,17,18,19,20,21,22,23,24,25,26,27,28,29,30,31,32,33,34,35,36,37,38,39,40,41,42,43,44,45,46,47,48,49,50,51,52,53,54,55,56,57,58,59,60]
[null,"Name","Bester Feld",null,null,null,null,null,null,null,null,null,null,null,null,null,null,null,null,null,null,null,null,null,null,null,25,26,27,28,29,30,31,32,33,34,35,36,37,38,39,40,41,42,43,44,45,46,47,48,49,50,51,52,53,54,55,56,57,58,59,60]
[null,"Vorvorfrucht"]
[null,"Vorfrucht"]
[null,"Zwischenfrucht"]
[null,"Frucht","Spargel"]
[null,"Sorte","Gijnlim"]
[null,"ha",3.8,null,null,null,null,null,null,null,null,null,null,null,null,null,null,null,null,null,null,null,null,null,null,null,null,null,null,null,null,null,null,null,null,null,null,null,null,null,null,null,null,null,null,null,null,null,null,null,null,null,null,null,null,null,null,null,null,null,null,null,{"$f":"SUM(C17:BJ17)","v":3.8}]
[]
[null,null,{"$f":"IF(C21<>\"\",(DAYS360(C21,Hauptmenü!$R$5)),0)","v":2773},{"$f":"IF(D21<>\"\",(DAYS360(D21,Hauptmenü!$R$5)),0)","v":0},{"$f":"IF(E21<>\"\",(DAYS360(E21,Hauptmenü!$R$5)),0)","v":0},{"$f":"IF(F21<>\"\",(DAYS360(F21,Hauptmenü!$R$5)),0)","v":0},{"$f":"IF(G21<>\"\",(DAYS360(G21,Hauptmenü!$R$5)),0)","v":0},{"$f":"IF(H21<>\"\",(DAYS360(H21,Hauptmenü!$R$5)),0)","v":0},{"$f":"IF(I21<>\"\",(DAYS360(I21,Hauptmenü!$R$5)),0)","v":0},{"$f":"IF(J21<>\"\",(DAYS360(J21,Hauptmenü!$R$5)),0)","v":0},{"$f":"IF(K21<>\"\",(DAYS360(K21,Hauptmenü!$R$5)),0)","v":0},null,null,null,null,null,{"$f":"IF(Q21<>\"\",(DAYS360(Q21,Hauptmenü!$R$5)),0)","v":0},{"$f":"IF(R21<>\"\",(DAYS360(R21,Hauptmenü!$R$5)),0)","v":0},{"$f":"IF(S21<>\"\",(DAYS360(S21,Hauptmenü!$R$5)),0)","v":0},{"$f":"IF(T21<>\"\",(DAYS360(T21,Hauptmenü!$R$5)),0)","v":0},{"$f":"IF(U21<>\"\",(DAYS360(U21,Hauptmenü!$R$5)),0)","v":0},{"$f":"IF(V21<>\"\",(DAYS360(V21,Hauptmenü!$R$5)),0)","v":0},{"$f":"IF(W21<>\"\",(DAYS360(W21,Hauptmenü!$R$5)),0)","v":0},{"$f":"IF(X21<>\"\",(DAYS360(X21,Hauptmenü!$R$5)),0)","v":0},{"$f":"IF(Y21<>\"\",(DAYS360(Y21,Hauptmenü!$R$5)),0)","v":0},{"$f":"IF(Z21<>\"\",(DAYS360(Z21,Hauptmenü!$R$5)),0)","v":0},{"$f":"IF(AA21<>\"\",(DAYS360(AA21,Hauptmenü!$R$5)),0)","v":0},{"$f":"IF(AB21<>\"\",(DAYS360(AB21,Hauptmenü!$R$5)),0)","v":0},{"$f":"IF(AC21<>\"\",(DAYS360(AC21,Hauptmenü!$R$5)),0)","v":0},{"$f":"IF(AD21<>\"\",(DAYS360(AD21,Hauptmenü!$R$5)),0)","v":0},{"$f":"IF(AE21<>\"\",(DAYS360(AE21,Hauptmenü!$R$5)),0)","v":0},{"$f":"IF(AF21<>\"\",(DAYS360(AF21,Hauptmenü!$R$5)),0)","v":0},{"$f":"IF(AG21<>\"\",(DAYS360(AG21,Hauptmenü!$R$5)),0)","v":0},{"$f":"IF(AH21<>\"\",(DAYS360(AH21,Hauptmenü!$R$5)),0)","v":0},{"$f":"IF(AI21<>\"\",(DAYS360(AI21,Hauptmenü!$R$5)),0)","v":0},{"$f":"IF(AJ21<>\"\",(DAYS360(AJ21,Hauptmenü!$R$5)),0)","v":0},{"$f":"IF(AK21<>\"\",(DAYS360(AK21,Hauptmenü!$R$5)),0)","v":0},{"$f":"IF(AL21<>\"\",(DAYS360(AL21,Hauptmenü!$R$5)),0)","v":0},{"$f":"IF(AM21<>\"\",(DAYS360(AM21,Hauptmenü!$R$5)),0)","v":0},{"$f":"IF(AN21<>\"\",(DAYS360(AN21,Hauptmenü!$R$5)),0)","v":0},{"$f":"IF(AO21<>\"\",(DAYS360(AO21,Hauptmenü!$R$5)),0)","v":0},{"$f":"IF(AP21<>\"\",(DAYS360(AP21,Hauptmenü!$R$5)),0)","v":0},{"$f":"IF(AQ21<>\"\",(DAYS360(AQ21,Hauptmenü!$R$5)),0)","v":0},{"$f":"IF(AR21<>\"\",(DAYS360(AR21,Hauptmenü!$R$5)),0)","v":0},{"$f":"IF(AS21<>\"\",(DAYS360(AS21,Hauptmenü!$R$5)),0)","v":0},{"$f":"IF(AT21<>\"\",(DAYS360(AT21,Hauptmenü!$R$5)),0)","v":0},{"$f":"IF(AU21<>\"\",(DAYS360(AU21,Hauptmenü!$R$5)),0)","v":0},{"$f":"IF(AV21<>\"\",(DAYS360(AV21,Hauptmenü!$R$5)),0)","v":0},{"$f":"IF(AW21<>\"\",(DAYS360(AW21,Hauptmenü!$R$5)),0)","v":0},{"$f":"IF(AX21<>\"\",(DAYS360(AX21,Hauptmenü!$R$5)),0)","v":0},{"$f":"IF(AY21<>\"\",(DAYS360(AY21,Hauptmenü!$R$5)),0)","v":0},{"$f":"IF(AZ21<>\"\",(DAYS360(AZ21,Hauptmenü!$R$5)),0)","v":0},{"$f":"IF(BA21<>\"\",(DAYS360(BA21,Hauptmenü!$R$5)),0)","v":0},{"$f":"IF(BB21<>\"\",(DAYS360(BB21,Hauptmenü!$R$5)),0)","v":0},{"$f":"IF(BC21<>\"\",(DAYS360(BC21,Hauptmenü!$R$5)),0)","v":0},{"$f":"IF(BD21<>\"\",(DAYS360(BD21,Hauptmenü!$R$5)),0)","v":0},{"$f":"IF(BE21<>\"\",(DAYS360(BE21,Hauptmenü!$R$5)),0)","v":0},{"$f":"IF(BF21<>\"\",(DAYS360(BF21,Hauptmenü!$R$5)),0)","v":0},{"$f":"IF(BG21<>\"\",(DAYS360(BG21,Hauptmenü!$R$5)),0)","v":0},{"$f":"IF(BH21<>\"\",(DAYS360(BH21,Hauptmenü!$R$5)),0)","v":0},{"$f":"IF(BI21<>\"\",(DAYS360(BI21,Hauptmenü!$R$5)),0)","v":0},{"$f":"IF(BJ21<>\"\",(DAYS360(BJ21,Hauptmenü!$R$5)),0)","v":0}]
[null,null,"Bodenuntersuchung:"]
[null,"Datum","2012-02-22"]
[null,"ph-Wert",6.8]
[null,"P2O5",21]
[null,"K2O",6]
[null,"MgO"]
[null,"Humus"]
[]
[]
[null,null,{"$f":"IF(C19>=2160,\"6 Jahresfrist abgelaufen!!\",\"\")","v":"6 Jahresfrist abgelaufen!!"},{"$f":"IF(D19>=2160,\"6 Jahresfrist abgelaufen!!\",\"\")","v":""},"","","","","","","","","","","","","","","","","","",{"$f":"IF(W19>=2160,\"6 Jahresfrist abgelaufen!!\",\"\")","v":""},"","","","","","","","","",{"$f":"IF(AG19>=2160,\"6 Jahresfrist abgelaufen!!\",\"\")","v":""},"","","","","","","","","","","","","","","","","","",{"$f":"IF(AZ19>=2160,\"6 Jahresfrist abgelaufen!!\",\"\")","v":""},"","","","","","","","","",""]
[null,null,"N-min-Untersuchung:"]
[null,"Datum","2018-05-19"]
[null,"0 - 30 cm",28]
[null,"30 - 60 cm",19]
[null,"60 - 90 cm",5]
[null,"NO3-N",{"$f":"IF(C32=\"\",\"\",(SUM(C32:C34)))","v":52},{"$f":"IF(D32=\"\",\"\",(SUM(D32:D34)))","v":""},"","","","","","","",{"$f":"IF(L32=\"\",\"\",(SUM(L32:L34)))","v":""},"","","","","","","","","","",{"$f":"IF(W32=\"\",\"\",(SUM(W32:W34)))","v":""},"","","","","","","","",{"$f":"IF(AF32=\"\",\"\",(SUM(AF32:AF34)))","v":""},"","","","","","","","","","","","","","","","","","","",{"$f":"IF(AZ32=\"\",\"\",(SUM(AZ32:AZ34)))","v":""},"","","","","","","","","",{"$f":"IF(BJ32=\"\",\"\",(SUM(BJ32:BJ34)))","v":""}]
[null,"NH4 - N"]
[null,"gesamt",{"$f":"IF(C32=\"\",\"\",C35+C36)","v":52},{"$f":"IF(D32=\"\",\"\",D35+D36)","v":""},"","","","","","","",{"$f":"IF(L32=\"\",\"\",L35+L36)","v":""},{"$f":"IF(M32=\"\",\"\",M35+M36)","v":""},{"$f":"IF(N32=\"\",\"\",N35+N36)","v":""},{"$f":"IF(O32=\"\",\"\",O35+O36)","v":""},{"$f":"IF(P32=\"\",\"\",P35+P36)","v":""},"","","","","","",{"$f":"IF(W32=\"\",\"\",W35+W36)","v":""},"","","","","","","","",{"$f":"IF(AF32=\"\",\"\",AF35+AF36)","v":""},"","","","","","","","","","","","","","","","","","","",{"$f":"IF(AZ32=\"\",\"\",AZ35+AZ36)","v":""},"","","","","","","","","",{"$f":"IF(BJ32=\"\",\"\",BJ35+BJ36)","v":""}]
[]
[]
[]
[]
[]
[null,"FLIK Nr."]
[null,"eigene Schlagnr."]
[null,"sonstiges"]
[null,"sonstiges"]
[]
[null,"Für die Richtigkeit der Berechnungen übernimmt Herr Große Dankbar keine Haftung!"]

{"sheet":"sonstiges","index":10,"n_rows":15,"n_cols":62,"rows_kept":15,"cut":false,"hidden":false,"merged":[]}
[]
[null,null,"Cross compliance, QS-Standard, Eurepgap, Global GAP"]
[null,"Jahr",{"$f":"Betriebsdaten!$L$3","v":"2019"},{"$f":"Betriebsdaten!$L$3","v":"2019"},{"$f":"Betriebsdaten!$L$3","v":"2019"},{"$f":"Betriebsdaten!$L$3","v":"2019"},{"$f":"Betriebsdaten!$L$3","v":"2019"},{"$f":"Betriebsdaten!$L$3","v":"2019"},{"$f":"Betriebsdaten!$L$3","v":"2019"},{"$f":"Betriebsdaten!$L$3","v":"2019"},{"$f":"Betriebsdaten!$L$3","v":"2019"},{"$f":"Betriebsdaten!$L$3","v":"2019"},{"$f":"Betriebsdaten!$L$3","v":"2019"},{"$f":"Betriebsdaten!$L$3","v":"2019"},{"$f":"Betriebsdaten!$L$3","v":"2019"},{"$f":"Betriebsdaten!$L$3","v":"2019"},{"$f":"Betriebsdaten!$L$3","v":"2019"},{"$f":"Betriebsdaten!$L$3","v":"2019"},{"$f":"Betriebsdaten!$L$3","v":"2019"},{"$f":"Betriebsdaten!$L$3","v":"2019"},{"$f":"Betriebsdaten!$L$3","v":"2019"},{"$f":"Betriebsdaten!$L$3","v":"2019"},{"$f":"Betriebsdaten!$L$3","v":"2019"},{"$f":"Betriebsdaten!$L$3","v":"2019"},{"$f":"Betriebsdaten!$L$3","v":"2019"},{"$f":"Betriebsdaten!$L$3","v":"2019"},{"$f":"Betriebsdaten!$L$3","v":"2019"},{"$f":"Betriebsdaten!$L$3","v":"2019"},{"$f":"Betriebsdaten!$L$3","v":"2019"},{"$f":"Betriebsdaten!$L$3","v":"2019"},{"$f":"Betriebsdaten!$L$3","v":"2019"},{"$f":"Betriebsdaten!$L$3","v":"2019"},{"$f":"Betriebsdaten!$L$3","v":"2019"},{"$f":"Betriebsdaten!$L$3","v":"2019"},{"$f":"Betriebsdaten!$L$3","v":"2019"},{"$f":"Betriebsdaten!$L$3","v":"2019"},{"$f":"Betriebsdaten!$L$3","v":"2019"},{"$f":"Betriebsdaten!$L$3","v":"2019"},{"$f":"Betriebsdaten!$L$3","v":"2019"},{"$f":"Betriebsdaten!$L$3","v":"2019"},{"$f":"Betriebsdaten!$L$3","v":"2019"},{"$f":"Betriebsdaten!$L$3","v":"2019"},{"$f":"Betriebsdaten!$L$3","v":"2019"},{"$f":"Betriebsdaten!$L$3","v":"2019"},{"$f":"Betriebsdaten!$L$3","v":"2019"},{"$f":"Betriebsdaten!$L$3","v":"2019"},{"$f":"Betriebsdaten!$L$3","v":"2019"},{"$f":"Betriebsdaten!$L$3","v":"2019"},{"$f":"Betriebsdaten!$L$3","v":"2019"},{"$f":"Betriebsdaten!$L$3","v":"2019"},{"$f":"Betriebsdaten!$L$3","v":"2019"},{"$f":"Betriebsdaten!$L$3","v":"2019"},{"$f":"Betriebsdaten!$L$3","v":"2019"},{"$f":"Betriebsdaten!$L$3","v":"2019"},{"$f":"Betriebsdaten!$L$3","v":"2019"},{"$f":"Betriebsdaten!$L$3","v":"2019"},{"$f":"Betriebsdaten!$L$3","v":"2019"},{"$f":"Betriebsdaten!$L$3","v":"2019"},{"$f":"Betriebsdaten!$L$3","v":"2019"},{"$f":"Betriebsdaten!$L$3","v":"2019"},{"$f":"Betriebsdaten!$L$3","v":"2019"},{"$f":"Betriebsdaten!$L$3","v":"2019"}]
[null,"Schlag",{"$f":"Betriebsdaten!C11","v":"Bester Feld"},{"$f":"Betriebsdaten!D11","v":0},{"$f":"Betriebsdaten!E11","v":0},{"$f":"Betriebsdaten!F11","v":0},{"$f":"Betriebsdaten!G11","v":0},{"$f":"Betriebsdaten!H11","v":0},{"$f":"Betriebsdaten!I11","v":0},{"$f":"Betriebsdaten!J11","v":0},{"$f":"Betriebsdaten!K11","v":0},{"$f":"Betriebsdaten!L11","v":0},{"$f":"Betriebsdaten!M11","v":0},{"$f":"Betriebsdaten!N11","v":0},{"$f":"Betriebsdaten!O11","v":0},{"$f":"Betriebsdaten!P11","v":0},{"$f":"Betriebsdaten!Q11","v":0},{"$f":"Betriebsdaten!R11","v":0},{"$f":"Betriebsdaten!S11","v":0},{"$f":"Betriebsdaten!T11","v":0},{"$f":"Betriebsdaten!U11","v":0},{"$f":"Betriebsdaten!V11","v":0},{"$f":"Betriebsdaten!W11","v":0},{"$f":"Betriebsdaten!X11","v":0},{"$f":"Betriebsdaten!Y11","v":0},{"$f":"Betriebsdaten!Z11","v":0},{"$f":"Betriebsdaten!AA11","v":25},{"$f":"Betriebsdaten!AB11","v":26},{"$f":"Betriebsdaten!AC11","v":27},{"$f":"Betriebsdaten!AD11","v":28},{"$f":"Betriebsdaten!AE11","v":29},{"$f":"Betriebsdaten!AF11","v":30},{"$f":"Betriebsdaten!AG11","v":31},{"$f":"Betriebsdaten!AH11","v":32},{"$f":"Betriebsdaten!AI11","v":33},{"$f":"Betriebsdaten!AJ11","v":34},{"$f":"Betriebsdaten!AK11","v":35},{"$f":"Betriebsdaten!AL11","v":36},{"$f":"Betriebsdaten!AM11","v":37},{"$f":"Betriebsdaten!AN11","v":38},{"$f":"Betriebsdaten!AO11","v":39},{"$f":"Betriebsdaten!AP11","v":40},{"$f":"Betriebsdaten!AQ11","v":41},{"$f":"Betriebsdaten!AR11","v":42},{"$f":"Betriebsdaten!AS11","v":43},{"$f":"Betriebsdaten!AT11","v":44},{"$f":"Betriebsdaten!AU11","v":45},{"$f":"Betriebsdaten!AV11","v":46},{"$f":"Betriebsdaten!AW11","v":47},{"$f":"Betriebsdaten!AX11","v":48},{"$f":"Betriebsdaten!AY11","v":49},{"$f":"Betriebsdaten!AZ11","v":50},{"$f":"Betriebsdaten!BA11","v":51},{"$f":"Betriebsdaten!BB11","v":52},{"$f":"Betriebsdaten!BC11","v":53},{"$f":"Betriebsdaten!BD11","v":54},{"$f":"Betriebsdaten!BE11","v":55},{"$f":"Betriebsdaten!BF11","v":56},{"$f":"Betriebsdaten!BG11","v":57},{"$f":"Betriebsdaten!BH11","v":58},{"$f":"Betriebsdaten!BI11","v":59},{"$f":"Betriebsdaten!BJ11","v":60}]
[null,"Frucht",{"$f":"Betriebsdaten!C15","v":"Spargel"},{"$f":"Betriebsdaten!D15","v":0},{"$f":"Betriebsdaten!E15","v":0},{"$f":"Betriebsdaten!F15","v":0},{"$f":"Betriebsdaten!G15","v":0},{"$f":"Betriebsdaten!H15","v":0},{"$f":"Betriebsdaten!I15","v":0},{"$f":"Betriebsdaten!J15","v":0},{"$f":"Betriebsdaten!K15","v":0},{"$f":"Betriebsdaten!L15","v":0},{"$f":"Betriebsdaten!M15","v":0},{"$f":"Betriebsdaten!N15","v":0},{"$f":"Betriebsdaten!O15","v":0},{"$f":"Betriebsdaten!P15","v":0},{"$f":"Betriebsdaten!Q15","v":0},{"$f":"Betriebsdaten!R15","v":0},{"$f":"Betriebsdaten!S15","v":0},{"$f":"Betriebsdaten!T15","v":0},{"$f":"Betriebsdaten!U15","v":0},{"$f":"Betriebsdaten!V15","v":0},{"$f":"Betriebsdaten!W15","v":0},{"$f":"Betriebsdaten!X15","v":0},{"$f":"Betriebsdaten!Y15","v":0},{"$f":"Betriebsdaten!Z15","v":0},{"$f":"Betriebsdaten!AA15","v":0},{"$f":"Betriebsdaten!AB15","v":0},{"$f":"Betriebsdaten!AC15","v":0},{"$f":"Betriebsdaten!AD15","v":0},{"$f":"Betriebsdaten!AE15","v":0},{"$f":"Betriebsdaten!AF15","v":0},{"$f":"Betriebsdaten!AG15","v":0},{"$f":"Betriebsdaten!AH15","v":0},{"$f":"Betriebsdaten!AI15","v":0},{"$f":"Betriebsdaten!AJ15","v":0},{"$f":"Betriebsdaten!AK15","v":0},{"$f":"Betriebsdaten!AL15","v":0},{"$f":"Betriebsdaten!AM15","v":0},{"$f":"Betriebsdaten!AN15","v":0},{"$f":"Betriebsdaten!AO15","v":0},{"$f":"Betriebsdaten!AP15","v":0},{"$f":"Betriebsdaten!AQ15","v":0},{"$f":"Betriebsdaten!AR15","v":0},{"$f":"Betriebsdaten!AS15","v":0},{"$f":"Betriebsdaten!AT15","v":0},{"$f":"Betriebsdaten!AU15","v":0},{"$f":"Betriebsdaten!AV15","v":0},{"$f":"Betriebsdaten!AW15","v":0},{"$f":"Betriebsdaten!AX15","v":0},{"$f":"Betriebsdaten!AY15","v":0},{"$f":"Betriebsdaten!AZ15","v":0},{"$f":"Betriebsdaten!BA15","v":0},{"$f":"Betriebsdaten!BB15","v":0},{"$f":"Betriebsdaten!BC15","v":0},{"$f":"Betriebsdaten!BD15","v":0},{"$f":"Betriebsdaten!BE15","v":0},{"$f":"Betriebsdaten!BF15","v":0},{"$f":"Betriebsdaten!BG15","v":0},{"$f":"Betriebsdaten!BH15","v":0},{"$f":"Betriebsdaten!BI15","v":0},{"$f":"Betriebsdaten!BJ15","v":0}]
[null,"ha",{"$f":"Betriebsdaten!C17","v":3.8},{"$f":"Betriebsdaten!D17","v":0},{"$f":"Betriebsdaten!E17","v":0},{"$f":"Betriebsdaten!F17","v":0},{"$f":"Betriebsdaten!G17","v":0},{"$f":"Betriebsdaten!H17","v":0},{"$f":"Betriebsdaten!I17","v":0},{"$f":"Betriebsdaten!J17","v":0},{"$f":"Betriebsdaten!K17","v":0},{"$f":"Betriebsdaten!L17","v":0},{"$f":"Betriebsdaten!M17","v":0},{"$f":"Betriebsdaten!N17","v":0},{"$f":"Betriebsdaten!O17","v":0},{"$f":"Betriebsdaten!P17","v":0},{"$f":"Betriebsdaten!Q17","v":0},{"$f":"Betriebsdaten!R17","v":0},{"$f":"Betriebsdaten!S17","v":0},{"$f":"Betriebsdaten!T17","v":0},{"$f":"Betriebsdaten!U17","v":0},{"$f":"Betriebsdaten!V17","v":0},{"$f":"Betriebsdaten!W17","v":0},{"$f":"Betriebsdaten!X17","v":0},{"$f":"Betriebsdaten!Y17","v":0},{"$f":"Betriebsdaten!Z17","v":0},{"$f":"Betriebsdaten!AA17","v":0},{"$f":"Betriebsdaten!AB17","v":0},{"$f":"Betriebsdaten!AC17","v":0},{"$f":"Betriebsdaten!AD17","v":0},{"$f":"Betriebsdaten!AE17","v":0},{"$f":"Betriebsdaten!AF17","v":0},{"$f":"Betriebsdaten!AG17","v":0},{"$f":"Betriebsdaten!AH17","v":0},{"$f":"Betriebsdaten!AI17","v":0},{"$f":"Betriebsdaten!AJ17","v":0},{"$f":"Betriebsdaten!AK17","v":0},{"$f":"Betriebsdaten!AL17","v":0},{"$f":"Betriebsdaten!AM17","v":0},{"$f":"Betriebsdaten!AN17","v":0},{"$f":"Betriebsdaten!AO17","v":0},{"$f":"Betriebsdaten!AP17","v":0},{"$f":"Betriebsdaten!AQ17","v":0},{"$f":"Betriebsdaten!AR17","v":0},{"$f":"Betriebsdaten!AS17","v":0},{"$f":"Betriebsdaten!AT17","v":0},{"$f":"Betriebsdaten!AU17","v":0},{"$f":"Betriebsdaten!AV17","v":0},{"$f":"Betriebsdaten!AW17","v":0},{"$f":"Betriebsdaten!AX17","v":0},{"$f":"Betriebsdaten!AY17","v":0},{"$f":"Betriebsdaten!AZ17","v":0},{"$f":"Betriebsdaten!BA17","v":0},{"$f":"Betriebsdaten!BB17","v":0},{"$f":"Betriebsdaten!BC17","v":0},{"$f":"Betriebsdaten!BD17","v":0},{"$f":"Betriebsdaten!BE17","v":0},{"$f":"Betriebsdaten!BF17","v":0},{"$f":"Betriebsdaten!BG17","v":0},{"$f":"Betriebsdaten!BH17","v":0},{"$f":"Betriebsdaten!BI17","v":0},{"$f":"Betriebsdaten!BJ17","v":0}]
[]
[null,"Bemerkungen","sehr trockenes Jahr, Beregnung direkt nach Ernte 4 x, Anfangs hoher Anteil (15%) hohle Stangen verworfen",null,null,4,5,6,7,8,9,10,11,12,13,14,15,16,17,18,19,20]
[null,"Fahrer Pflanzenschutzspritze","Ralf","LU","LU",null,null,null,null,null,null,"Ralf","Ralf"]
[null,"Fahrer Düngerstreuer","Theo","Theo","Ralf (AHL)"]
[null,"Lagerist"]
[null,"Wartezeiten eingehalten ja /nein","ja","ja","ja","ja"]
[null,"Abnehmer",null,"Landhandel"]
[null,"Gelagert in Raum:","Kühlraum 1"]
[null,"konserviert mit"]

{"sheet":"Schlag","index":11,"n_rows":96,"n_cols":12,"rows_kept":96,"cut":false,"hidden":false,"merged":[[93,3,93,4],[95,1,95,6],[13,0,21,0],[47,0,78,0],[96,1,96,6],[86,3,86,4],[87,3,87,4],[88,3,88,4],[89,3,89,4],[90,3,90,4],[91,3,91,4],[92,3,92,4]]}
[]
[null,"Betrieb","Schlag","Frucht","Größe","Sorte","Erntejahr"]
[null,{"$f":"Betriebsdaten!D4","v":"Große Dankbar"},{"$f":"INDIRECT(\"Betriebsdaten!\"&S_S&\"11\")","v":"Bester Feld"},{"$f":"INDIRECT(\"Betriebsdaten!\"&S_S&\"15\")","v":"Spargel"},{"$f":"INDIRECT(\"Betriebsdaten!\"&S_S&\"17\")","v":3.8},{"$f":"INDIRECT(\"Betriebsdaten!\"&S_S&\"16\")","v":"Gijnlim"},{"$f":"Betriebsdaten!L3","v":"2019"}]
[]
[null,"Bodenuntersuchung","pH - Wert","P2O5","K2O","MgO",{"$f":"Betriebsdaten!B26","v":"Humus"}]
[null,"in mg/100g Boden",{"$f":"INDIRECT(\"Betriebsdaten!\"&S_S&\"22\")","v":6.8},{"$f":"INDIRECT(\"Betriebsdaten!\"&S_S&\"23\")","v":21},{"$f":"INDIRECT(\"Betriebsdaten!\"&S_S&\"24\")","v":6},{"$f":"INDIRECT(\"Betriebsdaten!\"&S_S&\"25\")","v":0},{"$f":"INDIRECT(\"Betriebsdaten!\"&S_S&\"26\")","v":0},null,3,{"$f":"LEFT(ADDRESS(1,I6,4),LEN(ADDRESS(1,I6,4))-1)","v":"C"}]
[]
[null,"N -min","0-30 cm","30-60 cm","60-90 cm","NH4","gesamt"]
[null,"in kg/ha",{"$f":"INDIRECT(\"Betriebsdaten!\"&S_S&\"32\")","v":28},{"$f":"INDIRECT(\"Betriebsdaten!\"&S_S&\"33\")","v":19},{"$f":"INDIRECT(\"Betriebsdaten!\"&S_S&\"34\")","v":5},{"$f":"INDIRECT(\"Betriebsdaten!\"&S_S&\"36\")","v":0},{"$f":"SUM(C9:F9)","v":52}]
[null,"Aussaat/Pflanzung"]
[null,"Datum","Sorte","Menge/ha","€/Einheit","€/ha","€/gesamt"]
[null,{"$f":"INDIRECT(\"Saatgut!\" & S_S&\"7\")","v":"2014-04-13"},{"$f":"F3","v":"Gijnlim"},{"$f":"INDIRECT(\"Saatgut!\" & S_S&\"8\")","v":16000},{"$f":"INDIRECT(\"Saatgut!\" & S_S&\"11\")","v":0.31},{"$f":"INDIRECT(\"Saatgut!\" & S_S&\"15\")","v":4960},{"$f":"INDIRECT(\"Saatgut!\" & S_S&\"16\")","v":18848}]
[]
[null,"Datum der Düngung","Dünger","Menge ","kg N","kg P2O5","kg K2O"]
[null,{"$f":"INDIRECT(\"Düngung!\" & S_S  & I15)","v":"2018-05-25"},{"$f":"INDIRECT(\"Düngung!\" & S_S& I15+1)","v":"KAS"},{"$f":"INDIRECT(\"Düngung!\" & S_S& I15+3)","v":1},{"$f":"INDIRECT(\"Düngung!\"& S_S & J15)","v":27},{"$f":"INDIRECT(\"Düngung!\"& S_S & J15+62)","v":0},{"$f":"INDIRECT(\"Düngung!\" & S_S & J15+124)","v":0},null,7,187,{"$f":"INDIRECT(\"Auswertung!B\"  &ROW())","v":"Saatgut €/ha"},{"$f":"INDIRECT(\"Auswertung!\" & S_S &ROW())","v":826.66666666666663}]
[null,"2018-05-25","40 er Kali",2.5,0,0,100,null,12,{"$f":"J15+2","v":189},{"$f":"INDIRECT(\"Auswertung!B\"  &ROW())","v":"Dünger €/ha"},99.125]
[null,"00:00:00",0,0,0,0,0,null,17,{"$f":"J16+2","v":191},"Pflanzenschutz €/ha",238.26750000000001]
[null,"00:00:00",0,0,0,0,0,null,22,193,"Kosten Ackerbau €/ha",1448.5]
[null,"00:00:00",0,0,0,0,0,null,27,195,"davon Lohnuntern./ha",520]
[null,"00:00:00",0,0,0,0,0,null,32,197,"Lohnkosten €/ha",13780]
[null,"00:00:00",0,0,0,0,0,null,37,199,"Materialkosten €/ha",1686.01]
[null,"00:00:00",0,0,0,0,0,null,42,201,"sonst. var. Kosten €/ha",3468]
[null,{"$f":"INDIRECT(\"Düngung!\" & S_S  & I23)","v":"00:00:00"},{"$f":"INDIRECT(\"Düngung!\" & S_S& I23+1)","v":0},{"$f":"INDIRECT(\"Düngung!\" & S_S& I23+3)","v":0},{"$f":"INDIRECT(\"Düngung!\"& S_S & J23)","v":0},0,0,null,47,203,0,0]
[null,"00:00:00",0,0,0,0,0,null,52,205,0,0]
[null,"00:00:00",0,0,0,0,0,null,57,207,"Summe Direktkosten",21546.569166666668]
[null,"00:00:00",0,0,0,0,0,null,62,209,0,0]
[null,"00:00:00",0,0,0,0,0,null,67,211,"Deckungsbeitrag l /ha",6908.6939912280723]
[null,"00:00:00",0,0,0,0,0,null,72,213,0,0]
[null,"00:00:00",0,0,0,0,0,null,77,215,"Festkosten/ha",3250]
[null,"00:00:00",0,0,0,0,0,null,82,217,0,0]
[null,"00:00:00",0,0,0,0,0,null,87,219,"Deckungsbeitrag ll /ha",3658.6939912280723]
[null,"00:00:00",0,0,0,0,0,null,92,221,0,0]
[null,"00:00:00",0,{"$f":"INDIRECT(\"Düngung!\" & S_S& I33+3)","v":0},{"$f":"INDIRECT(\"Düngung!\"& S_S & J33)","v":0},0,0,null,97,223,"Lohnansatz/ha",1200]
[null,"00:00:00",0,0,0,0,0,null,102,225,"Pachtansatz/ha",1200]
[null,"00:00:00",0,0,0,0,0,null,107,227,"Zinsansatz/ha",0]
[null,"00:00:00",0,0,0,0,0,null,112,229,0,0]
[null,"00:00:00",0,0,0,0,0,null,117,231,"Unternehmergewinn/ha",1258.6939912280723]
[null,"00:00:00",0,0,0,0,0,null,122,233,0,0]
[null,"00:00:00",0,0,0,0,0,null,127,235,"Leistung €/gesamt",108130.00000000001]
[null,"00:00:00",0,0,0,0,0,null,132,237,"Kosten €/gesamt",94226.962833333324]
[null,"00:00:00",0,0,0,0,0,null,137,239,"Gewinn €/gesamt",13903.037166666691]
[null,"00:00:00",0,0,0,0,0,null,142,241,"Unternehmergewinn",4783.0371666666742]
[null,"00:00:00",0,0,0,0,0,null,147,243,0,0]
[null,"00:00:00",0,0,0,0,0,null,152,245,"Direktkosten pro kg ",3.4115401180555556]
[null,"00:00:00",0,0,0,0,0,null,157,247,"Gesamtosten pro kg ",4.3061234513888893]
[null,"Summe Nährstoffe/ha",null,null,{"$f":"SUM(E15:E32)","v":27},{"$f":"SUM(F15:F32)","v":0},{"$f":"SUM(G15:G32)","v":100},null,null,null,0,0]
[]
[null,"Datum PS Einsatz","Mittel","Preis/Einheit","Menge/ha","€/ha","€/gesamt"]
[null,{"$f":"INDIRECT(\"PSM!\" & S_S&I49)","v":"2018-05-27"},{"$f":"INDIRECT(\"PSM!\" & S_S&I49+1)","v":"Stomp Aqua 3,5 + Sencor liquid 0,4"},{"$f":"INDIRECT(\"PSM!\" & S_S&I49+2)","v":56.22},{"$f":"INDIRECT(\"PSM!\" & S_S&I49+3)","v":1},{"$f":"IF(D49>0.001,D49*E49,\"\")","v":56.22},{"$f":"IF(F49<>\"\",F49*$E$3,\"\")","v":213.636},null,7]
[null,"2018-07-21","Amistar Opti",18.600000000000001,2.5,{"$f":"IF(D50>0.001,D50*E50,\"\")","v":46.5},{"$f":"IF(F50<>\"\",F50*$E$3,\"\")","v":176.7},null,12]
[null,"2018-08-07","Cuprozin progress",29.8,2,{"$f":"IF(D51>0.001,D51*E51,\"\")","v":59.6},226.48,null,17]
[null,"2018-08-28","Amistar Opti",18.600000000000001,2.5,46.5,176.7,null,22]
[null,"2018-08-28","Buctril 0,5 + Sencor liquid 0,5",19.149999999999999,1,19.149999999999999,72.77,null,27]
[null,"2018-08-28","Karate Zeon",137.30000000000001,7.4999999999999997E-2,10.297500000000001,39.130500000000005,null,32]
[null,"00:00:00","00:00:00",0,0,"","",null,37]
[null,{"$f":"INDIRECT(\"PSM!\" & S_S&I56)","v":"00:00:00"},{"$f":"INDIRECT(\"PSM!\" & S_S&I56+1)","v":"00:00:00"},{"$f":"INDIRECT(\"PSM!\" & S_S&I56+2)","v":0},{"$f":"INDIRECT(\"PSM!\" & S_S&I56+3)","v":0},{"$f":"IF(D56>0.001,D56*E56,\"\")","v":""},{"$f":"IF(F56<>\"\",F56*$E$3,\"\")","v":""},null,42]
[null,"00:00:00","00:00:00",0,0,"","",null,47]
[null,"00:00:00","00:00:00",0,0,"","",null,52]
[null,"00:00:00","00:00:00",0,0,"","",null,57]
[null,"00:00:00","00:00:00",0,0,"","",null,62]
[null,"00:00:00","00:00:00",0,0,"","",null,67]
[null,"00:00:00","00:00:00",0,0,"","",null,72]
[null,"00:00:00","00:00:00",0,0,"","",null,77]
[null,"00:00:00","00:00:00",0,0,"","",null,82]
[null,"00:00:00","00:00:00",0,0,"","",null,87]
[null,"00:00:00","00:00:00",0,0,"","",null,92]
[null,"00:00:00","00:00:00",0,0,"","",null,97]
[null,"00:00:00","00:00:00",0,0,"","",null,102]
[null,"00:00:00","00:00:00",0,0,"","",null,107]
[null,"00:00:00","00:00:00",0,0,"","",null,112]
[null,"00:00:00","00:00:00",0,0,"","",null,117]
[null,"00:00:00","00:00:00",0,0,"","",null,122]
[null,"00:00:00","00:00:00",0,0,"","",null,127]
[null,"00:00:00","00:00:00",0,0,"","",null,132]
[null,"00:00:00","00:00:00",0,0,"","",null,137]
[null,"00:00:00","00:00:00",0,0,"","",null,142]
[null,"00:00:00","00:00:00",0,0,"","",null,147]
[null,"00:00:00","00:00:00",0,0,"","",null,152]
[]
[null,null,null,null,null,{"$f":"SUM(F49:F65)","v":238.26750000000001},{"$f":"SUM(G49:G65)","v":905.41650000000004}]
[null,"Ertrag","Erlös/dt","Erlös/ha","Prämie","sonstiges","Einnahmen"]
[null,{"$f":"INDIRECT(\"Auswertung!\" & S_S &\"9\")","v":63.15789473684211},{"$f":"INDIRECT(\"Auswertung!\" & S_S &\"10\")","v":445},{"$f":"B82*C82","v":28105.26315789474},{"$f":"INDIRECT(\"Auswertung!\" & S_S &\"11\")","v":350},{"$f":"INDIRECT(\"Auswertung!\" & S_S &\"12\")","v":0},{"$f":"D82+E82+F82","v":28455.26315789474}]
[]
[null,"Lohnkosten","Materialkosten","Pflanzgut","Düng/PS","Ackerbau","Festkosten"]
[null,{"$f":"INDIRECT(\"Auswertung!\" & S_S &\"20\")","v":13780},{"$f":"INDIRECT(\"Auswertung!\" & S_S &\"21\")","v":1686.01},{"$f":"INDIRECT(\"Auswertung!\" & S_S &\"15\")","v":826.66666666666663},{"$f":"INDIRECT(\"Auswertung!\" & S_S &\"16\")+INDIRECT(\"Auswertung!\" & S_S &\"17\")","v":337.39250000000004},{"$f":"INDIRECT(\"Auswertung!\" & S_S &\"18\")","v":1448.5},{"$f":"INDIRECT(\"Auswertung!\" & S_S &\"29\")","v":3250}]
[null,"ökonomische Betrachtung:"]
[null,null,"€/ha","€/gesamt"]
[null,"Leistung",{"$f":"INDIRECT(\"Auswertung!\" & S_S &\"13\")","v":28455.26315789474},{"$f":"C88*$E$3","v":108130.00000000001}]
[" -","Direktkosten",{"$f":"INDIRECT(\"Auswertung!\" & S_S &\"25\")","v":21546.569166666668},{"$f":"C89*$E$3","v":81876.962833333338}]
["=","DB I",{"$f":"INDIRECT(\"Auswertung!\" & S_S &\"27\")","v":6908.6939912280723},26253.037166666672]
[" -","Festkosten",{"$f":"INDIRECT(\"Auswertung!\" & S_S &\"29\")+INDIRECT(\"Auswertung!\" & S_S &\"30\")","v":3250},12350]
[" =","DB II",{"$f":"INDIRECT(\"Auswertung!\" & S_S &\"31\")","v":3658.6939912280723},13903.037166666674]
[" -","Lohn-, Pacht-, Zinsansatz",{"$f":"INDIRECT(\"Auswertung!\" & S_S &\"33\")+INDIRECT(\"Auswertung!\" & S_S &\"34\")+INDIRECT(\"Auswertung!\" & S_S &\"35\")+INDIRECT(\"Auswertung!\" & S_S &\"36\")","v":2400},9120]
[" =","Unternehmergewinn",{"$f":"INDIRECT(\"Auswertung!\" & S_S &\"37\")","v":1258.6939912280723},4783.0371666666742]
[null,"Bemerkungen:"]
[null,{"$f":"INDIRECT(\"sonstiges!\" & S_S &\"8\")","v":"sehr trockenes Jahr, Beregnung direkt nach Ernte 4 x, Anfangs hoher Anteil (15%) hohle Stangen verworfen"}]

{"sheet":"Durchschnittspreise","index":12,"n_rows":92,"n_cols":79,"rows_kept":92,"cut":false,"hidden":false,"merged":[[6,3,6,6],[6,33,6,36],[4,13,4,16],[6,13,6,16],[2,31,2,32],[2,33,2,36],[6,23,6,26],[2,41,2,42],[2,13,2,16],[4,33,4,36],[4,43,4,46],[2,43,2,46],[2,73,2,76],[4,73,4,76],[6,73,6,76],[6,63,6,66],[2,63,2,66],[2,71,2,72],[2,1,2,2],[2,21,2,22],[2,23,2,26],[4,23,4,26],[2,3,2,6],[2,11,2,12],[4,3,4,6],[6,43,6,46],[4,63,4,66],[4,53,4,56],[6,53,6,56],[2,51,2,52],[2,61,2,62],[2,53,2,56]]}
[]
[null,null,null,null,null,null,"Verkaufstage",{"$f":"H9+H23+H37+H51+H65+H79","v":67},null,null,null,null,null,null,null,null,"Verkaufstage",{"$f":"R9+R23+R37+R51+R65+R79","v":32},null,null,null,null,null,null,null,null,"Verkaufstage",{"$f":"AB9+AB23+AB37+AB51+AB65+AB79","v":7},null,null,null,null,null,null,null,null,"Verkaufstage",{"$f":"AL9+AL23+AL37+AL51+AL65+AL79","v":7},null,null,null,null,null,null,null,null,"Verkaufstage",{"$f":"AV9+AV23+AV37+AV51+AV65+AV79","v":7},null,null,null,null,null,null,null,null,"Verkaufstage",{"$f":"BF9+BF23+BF37+BF51+BF65+BF79","v":7},null,null,null,null,null,null,null,null,"Verkaufstage",{"$f":"BP9+BP23+BP37+BP51+BP65+BP79","v":7},null,null,null,null,null,null,null,null,"Verkaufstage",{"$f":"BZ9+BZ23+BZ37+BZ51+BZ65+BZ79","v":7}]
[null,"Hofladen",null,"berechneter Durchschnittspreis",null,null,null,{"$f":"I3/H2","v":4.8926845274019719},{"$f":"SUM(I9:I91)","v":327.80986333593211},null,null,"Rewe Köln",null,"berechneter Durchschnittspreis",null,null,null,{"$f":"S3/R2","v":0},{"$f":"SUM(S9:S91)","v":0},null,null,null,null,"berechneter Durchschnittspreis",null,null,null,{"$f":"AC3/AB2","v":0},{"$f":"SUM(AC9:AC91)","v":0},null,null,null,null,"berechneter Durchschnittspreis",null,null,null,{"$f":"AM3/AL2","v":0},{"$f":"SUM(AM9:AM91)","v":0},null,null,null,null,"berechneter Durchschnittspreis",null,null,null,{"$f":"AW3/AV2","v":0},{"$f":"SUM(AW9:AW91)","v":0},null,null,null,null,"berechneter Durchschnittspreis",null,null,null,{"$f":"BG3/BF2","v":0},{"$f":"SUM(BG9:BG91)","v":0},null,null,null,null,"berechneter Durchschnittspreis",null,null,null,{"$f":"BQ3/BP2","v":0},{"$f":"SUM(BQ9:BQ91)","v":0},null,null,null,null,"berechneter Durchschnittspreis",null,null,null,{"$f":"CA3/BZ2","v":0},{"$f":"SUM(CA9:CA91)","v":0}]
[]
[null,null,null,{"$f":"\"Verkaufsmenge \" &B3 & \" gesamt\"","v":"Verkaufsmenge Hofladen gesamt"},null,null,null,{"$f":"B21+B35+B49+B63+B77+B91","v":18346},null,null,null,null,null,{"$f":"\"Verkaufsmenge \" &L3 & \" gesamt\"","v":"Verkaufsmenge Rewe Köln gesamt"},null,null,null,{"$f":"L21+L35+L49+L63+L77+L91","v":0},null,null,null,null,null,{"$f":"\"Verkaufsmenge \" &V3 & \" gesamt\"","v":"Verkaufsmenge  gesamt"},null,null,null,{"$f":"V21+V35+V49+V63+V77+V91","v":0},null,null,null,null,null,{"$f":"\"Verkaufsmenge \" &AF3 & \" gesamt\"","v":"Verkaufsmenge  gesamt"},null,null,null,{"$f":"AF21+AF35+AF49+AF63+AF77+AF91","v":0},null,null,null,null,null,{"$f":"\"Verkaufsmenge \" &AP3 & \" gesamt\"","v":"Verkaufsmenge  gesamt"},null,null,null,{"$f":"AP21+AP35+AP49+AP63+AP77+AP91","v":0},null,null,null,null,null,{"$f":"\"Verkaufsmenge \" &AZ3 & \" gesamt\"","v":"Verkaufsmenge  gesamt"},null,null,null,{"$f":"AZ21+AZ35+AZ49+AZ63+AZ77+AZ91","v":0},null,null,null,null,null,{"$f":"\"Verkaufsmenge \" &BJ3 & \" gesamt\"","v":"Verkaufsmenge  gesamt"},null,null,null,{"$f":"BJ21+BJ35+BJ49+BJ63+BJ77+BJ91","v":100},null,null,null,null,null,{"$f":"\"Verkaufsmenge \" &BT3 & \" gesamt\"","v":"Verkaufsmenge  gesamt"},null,null,null,{"$f":"BT21+BT35+BT49+BT63+BT77+BT91","v":0}]
[]
[null,null,null,{"$f":"\" Verkaufsmenge \"&B3&\" täglich\"","v":" Verkaufsmenge Hofladen täglich"},null,null,null,{"$f":"H5/H2","v":273.82089552238807},null,null,null,null,null,{"$f":"\" Verkaufsmenge \"&L3&\" täglich\"","v":" Verkaufsmenge Rewe Köln täglich"},null,null,null,{"$f":"R5/R2","v":0},null,null,null,null,null,{"$f":"\" Verkaufsmenge \"&V3&\" täglich\"","v":" Verkaufsmenge  täglich"},null,null,null,{"$f":"AB5/AB2","v":0},null,null,null,null,null,{"$f":"\" Verkaufsmenge \"&AF3&\" täglich\"","v":" Verkaufsmenge  täglich"},null,null,null,{"$f":"AL5/AL2","v":0},null,null,null,null,null,{"$f":"\" Verkaufsmenge \"&AP3&\" täglich\"","v":" Verkaufsmenge  täglich"},null,null,null,{"$f":"AV5/AV2","v":0},null,null,null,null,null,{"$f":"\" Verkaufsmenge \"&AZ3&\" täglich\"","v":" Verkaufsmenge  täglich"},null,null,null,{"$f":"BF5/BF2","v":0},null,null,null,null,null,{"$f":"\" Verkaufsmenge \"&BJ3&\" täglich\"","v":" Verkaufsmenge  täglich"},null,null,null,{"$f":"BP5/BP2","v":14.285714285714286},null,null,null,null,null,{"$f":"\" Verkaufsmenge \"&BT3&\" täglich\"","v":" Verkaufsmenge  täglich"},null,null,null,{"$f":"BZ5/BZ2","v":0}]
[]
[null,null,null,"Datum vom","2008-04-15","bis","2008-04-22",{"$f":"G9-E9","v":7},{"$f":"IF(G21<>\"\",(G21*H9),0)","v":50.77140169332079},null,null,null,null,"Datum vom","2008-04-15","bis","2008-04-22",{"$f":"Q9-O9","v":7},{"$f":"IF(Q21<>\"\",(Q21*R9),0)","v":0},null,null,null,null,"Datum vom","2008-04-15","bis","2008-04-22",{"$f":"AA9-Y9","v":7},{"$f":"IF(AA21<>\"\",(AA21*AB9),0)","v":0},null,null,null,null,"Datum vom","2008-04-15","bis","2008-04-22",{"$f":"AK9-AI9","v":7},{"$f":"IF(AK21<>\"\",(AK21*AL9),0)","v":0},null,null,null,null,"Datum vom","2008-04-15","bis","2008-04-22",{"$f":"AU9-AS9","v":7},{"$f":"IF(AU21<>\"\",(AU21*AV9),0)","v":0},null,null,null,null,"Datum vom","2008-04-15","bis","2008-04-22",{"$f":"BE9-BC9","v":7},{"$f":"IF(BE21<>\"\",(BE21*BF9),0)","v":0},null,null,null,null,"Datum vom","2008-04-15","bis","2008-04-22",{"$f":"BO9-BM9","v":7},{"$f":"IF(BO21<>\"\",(BO21*BP9),0)","v":0},null,null,null,null,"Datum vom","2008-04-15","bis","2008-04-22",{"$f":"BY9-BW9","v":7},{"$f":"IF(BY21<>\"\",(BY21*BZ9),0)","v":0}]
[null,"kg","% errechnet","ca. % ","Klassen","Preis 1","€/kg",null,null,null,null,"kg","% errechnet","ca. % ","Klassen","Preis 1","€/kg",null,null,null,null,"kg","% errechnet","ca. % ","Klassen","Preis 1","€/kg",null,null,null,null,"kg","% errechnet","ca. % ","Klassen","Preis 1","€/kg",null,null,null,null,"kg","% errechnet","ca. % ","Klassen","Preis 1","€/kg",null,null,null,null,"kg","% errechnet","ca. % ","Klassen","Preis 1","€/kg",null,null,null,null,"kg","% errechnet","ca. % ","Klassen","Preis 1","€/kg",null,null,null,null,"kg","% errechnet","ca. % ","Klassen","Preis 1","€/kg"]
[null,325,{"$f":"IF(B11>1,(B11/B$21*100),\"\")","v":30.573847601128879},null,"Klasse 1",8.5,{"$f":"IF(C11<>\"\",(F11*(C11/100)),F11*(D11/100))","v":2.5987770460959547},null,null,null,null,null,{"$f":"IF(L11>1,(L11/L$21*100),\"\")","v":""},null,"Klasse 1",null,{"$f":"IF(M11<>\"\",(P11*(M11/100)),P11*(N11/100))","v":0},null,null,null,null,null,{"$f":"IF(V11>1,(V11/V$21*100),\"\")","v":""},null,"Klasse 1",null,{"$f":"IF(W11<>\"\",(Z11*(W11/100)),Z11*(X11/100))","v":0},null,null,null,null,null,{"$f":"IF(AF11>1,(AF11/AF$21*100),\"\")","v":""},null,"Klasse 1",null,{"$f":"IF(AG11<>\"\",(AJ11*(AG11/100)),AJ11*(AH11/100))","v":0},null,null,null,null,null,{"$f":"IF(AP11>1,(AP11/AP$21*100),\"\")","v":""},null,"Klasse 1",null,{"$f":"IF(AQ11<>\"\",(AT11*(AQ11/100)),AT11*(AR11/100))","v":0},null,null,null,null,null,{"$f":"IF(AZ11>1,(AZ11/AZ$21*100),\"\")","v":""},null,"Klasse 1",null,{"$f":"IF(BA11<>\"\",(BD11*(BA11/100)),BD11*(BB11/100))","v":0},null,null,null,null,100,{"$f":"IF(BJ11>1,(BJ11/BJ$21*100),\"\")","v":100},null,"Klasse 1",null,{"$f":"IF(BK11<>\"\",(BN11*(BK11/100)),BN11*(BL11/100))","v":0},null,null,null,null,null,{"$f":"IF(BT11>1,(BT11/BT$21*100),\"\")","v":""},null,null,null,{"$f":"IF(BU11<>\"\",(BX11*(BU11/100)),BX11*(BV11/100))","v":0}]
[null,288,{"$f":"IF(B12>1,(B12/B$21*100),\"\")","v":27.0931326434619},null,"Klasse 1 vio",7.5,2.0319849482596424,null,null,null,null,null,{"$f":"IF(L12>1,(L12/L$21*100),\"\")","v":""},null,"Klasse 1 vio",null,0,null,null,null,null,null,{"$f":"IF(V12>1,(V12/V$21*100),\"\")","v":""},null,"Klasse 1 vio",null,0,null,null,null,null,null,{"$f":"IF(AF12>1,(AF12/AF$21*100),\"\")","v":""},null,"Klasse 1 vio",null,0,null,null,null,null,null,{"$f":"IF(AP12>1,(AP12/AP$21*100),\"\")","v":""},null,"Klasse 1 vio",null,0,null,null,null,null,null,{"$f":"IF(AZ12>1,(AZ12/AZ$21*100),\"\")","v":""},null,"Klasse 1 vio",null,0,null,null,null,null,null,{"$f":"IF(BJ12>1,(BJ12/BJ$21*100),\"\")","v":""},null,"Klasse 1 vio",null,0,null,null,null,null,null,{"$f":"IF(BT12>1,(BT12/BT$21*100),\"\")","v":""},null,null,null,0]
[null,240,22.577610536218252,null,"Klasse 2",7,1.5804327375352776,null,null,null,null,null,"",null,"Klasse 2",null,0,null,null,null,null,null,"",null,"Klasse 2",null,0,null,null,null,null,null,"",null,"Klasse 2",null,0,null,null,null,null,null,"",null,"Klasse 2",null,0,null,null,null,null,null,"",null,"Klasse 2",null,0,null,null,null,null,null,"",null,"Klasse 2",null,0,null,null,null,null,null,"",null,null,null,0]
[null,120,11.288805268109126,null,"Klasse 2 vio",6.5,0.73377234242709322,null,null,null,null,null,"",null,"Klasse 2 vio",null,0,null,null,null,null,null,"",null,"Klasse 2 vio",null,0,null,null,null,null,null,"",null,"Klasse 2 vio",null,0,null,null,null,null,null,"",null,"Klasse 2 vio",null,0,null,null,null,null,null,"",null,"Klasse 2 vio",null,0,null,null,null,null,null,"",null,"Klasse 2 vio",null,0,null,null,null,null,null,"",null,null,null,0]
[null,25,2.3518344308560679,null,"Suppe",3,7.0555032925682049E-2,null,null,null,null,null,"",null,"Suppe",null,0,null,null,null,null,null,"",null,"Suppe",null,0,null,null,null,null,null,"",null,"Suppe",null,0,null,null,null,null,null,"",null,"Suppe",null,0,null,null,null,null,null,"",null,"Suppe",null,0,null,null,null,null,null,"",null,"Suppe",null,0,null,null,null,null,null,"",null,null,null,0]
[null,45,4.2333019755409218,null,"Bruch",2.5,0.10583254938852305,null,null,null,null,null,"",null,"Bruch",null,0,null,null,null,null,null,"",null,"Bruch",null,0,null,null,null,null,null,"",null,"Bruch",null,0,null,null,null,null,null,"",null,"Bruch",null,0,null,null,null,null,null,"",null,"Bruch",null,0,null,null,null,null,null,"",null,"Bruch",null,0,null,null,null,null,null,"",null,null,null,0]
[null,20,1.8814675446848541,null,"Spitzen",7,0.13170272812793979,null,null,null,null,null,"",null,"Spitzen",null,0,null,null,null,null,null,"",null,"Spitzen",null,0,null,null,null,null,null,"",null,"Spitzen",null,0,null,null,null,null,null,"",null,"Spitzen",null,0,null,null,null,null,null,"",null,"Spitzen",null,0,null,null,null,null,null,"",null,"Spitzen",null,0,null,null,null,null,null,"",null,null,null,0]
[null,null,"",null,null,null,0,null,null,null,null,null,"",null,null,null,0,null,null,null,null,null,"",null,null,null,0,null,null,null,null,null,"",null,null,null,0,null,null,null,null,null,"",null,null,null,0,null,null,null,null,null,"",null,null,null,0,null,null,null,null,null,"",null,null,null,0,null,null,null,null,null,"",null,null,null,0]
[null,null,"",null,null,null,0,null,null,null,null,null,"",null,null,null,0,null,null,null,null,null,"",null,null,null,0,null,null,null,null,null,"",null,null,null,0,null,null,null,null,null,"",null,null,null,0,null,null,null,null,null,"",null,null,null,0,null,null,null,null,null,"",null,null,null,0,null,null,null,null,null,"",null,null,null,0]
[null,null,"",null,null,null,0,null,null,null,null,null,"",null,null,null,0,null,null,null,null,null,"",null,null,null,0,null,null,null,null,null,"",null,null,null,0,null,null,null,null,null,"",null,null,null,0,null,null,null,null,null,"",null,null,null,0,null,null,null,null,null,"",null,null,null,0,null,null,null,null,null,"",null,null,null,0]
[null,{"$f":"SUM(B11:B20)","v":1063},null,{"$f":"SUM(D11:D20)","v":0},null,null,{"$f":"IF(SUM(G11:G20)=0,\"\",(SUM(G11:G20)))","v":7.2530573847601127},null,null,null,null,{"$f":"SUM(L11:L20)","v":0},null,{"$f":"SUM(N11:N20)","v":0},null,null,{"$f":"IF(SUM(Q11:Q20)=0,\"\",(SUM(Q11:Q20)))","v":""},null,null,null,null,{"$f":"SUM(V11:V20)","v":0},null,{"$f":"SUM(X11:X20)","v":0},null,null,{"$f":"IF(SUM(AA11:AA20)=0,\"\",(SUM(AA11:AA20)))","v":""},null,null,null,null,{"$f":"SUM(AF11:AF20)","v":0},null,{"$f":"SUM(AH11:AH20)","v":0},null,null,{"$f":"IF(SUM(AK11:AK20)=0,\"\",(SUM(AK11:AK20)))","v":""},null,null,null,null,{"$f":"SUM(AP11:AP20)","v":0},null,{"$f":"SUM(AR11:AR20)","v":0},null,null,{"$f":"IF(SUM(AU11:AU20)=0,\"\",(SUM(AU11:AU20)))","v":""},null,null,null,null,{"$f":"SUM(AZ11:AZ20)","v":0},null,{"$f":"SUM(BB11:BB20)","v":0},null,null,{"$f":"IF(SUM(BE11:BE20)=0,\"\",(SUM(BE11:BE20)))","v":""},null,null,null,null,{"$f":"SUM(BJ11:BJ20)","v":100},null,{"$f":"SUM(BL11:BL20)","v":0},null,null,{"$f":"IF(SUM(BO11:BO20)=0,\"\",(SUM(BO11:BO20)))","v":""},null,null,null,null,{"$f":"SUM(BT11:BT20)","v":0},null,{"$f":"SUM(BV11:BV20)","v":0},null,null,{"$f":"IF(SUM(BY11:BY20)=0,\"\",(SUM(BY11:BY20)))","v":""}]
[null,{"$f":"IF(B21<1,\"\",B21/H9)","v":151.85714285714286},null,null,null,null,null,null,null,null,null,{"$f":"IF(L21<1,\"\",L21/R9)","v":""},null,null,null,null,null,null,null,null,null,{"$f":"IF(V21<1,\"\",V21/AB9)","v":""},null,null,null,null,null,null,null,null,null,{"$f":"IF(AF21<1,\"\",AF21/AL9)","v":""},null,null,null,null,null,null,null,null,null,{"$f":"IF(AP21<1,\"\",AP21/AV9)","v":""},null,null,null,null,null,null,null,null,null,{"$f":"IF(AZ21<1,\"\",AZ21/BF9)","v":""},null,null,null,null,null,null,null,null,null,{"$f":"IF(BJ21<1,\"\",BJ21/BP9)","v":14.285714285714286},null,null,null,null,null,null,null,null,null,{"$f":"IF(BT21<1,\"\",BT21/BZ9)","v":""}]
[null,null,null,"Datum vom",{"$f":"G9+1","v":"2008-04-23"},"bis","2008-05-07",{"$f":"IF(G23=\"\",0,(G23-E23))","v":14},{"$f":"IF(G35<>\"\",(G35*H23),0)","v":87.672348484848484},null,null,null,null,"Datum vom",{"$f":"Q9+1","v":"2008-04-23"},"bis","2008-05-18",{"$f":"IF(Q23=\"\",0,(Q23-O23))","v":25},{"$f":"IF(Q35<>\"\",(Q35*R23),0)","v":0},null,null,null,null,"Datum vom",{"$f":"AA9+1","v":"2008-04-23"},"bis",null,{"$f":"IF(AA23=\"\",0,(AA23-Y23))","v":0},{"$f":"IF(AA35<>\"\",(AA35*AB23),0)","v":0},null,null,null,null,"Datum vom",{"$f":"AK9+1","v":"2008-04-23"},"bis",null,{"$f":"IF(AK23=\"\",0,(AK23-AI23))","v":0},{"$f":"IF(AK35<>\"\",(AK35*AL23),0)","v":0},null,null,null,null,"Datum vom",{"$f":"AU9+1","v":"2008-04-23"},"bis",null,{"$f":"IF(AU23=\"\",0,(AU23-AS23))","v":0},{"$f":"IF(AU35<>\"\",(AU35*AV23),0)","v":0},null,null,null,null,"Datum vom",{"$f":"BE9+1","v":"2008-04-23"},"bis",null,{"$f":"IF(BE23=\"\",0,(BE23-BC23))","v":0},{"$f":"IF(BE35<>\"\",(BE35*BF23),0)","v":0},null,null,null,null,"Datum vom",{"$f":"BO9+1","v":"2008-04-23"},"bis",null,{"$f":"IF(BO23=\"\",0,(BO23-BM23))","v":0},{"$f":"IF(BO35<>\"\",(BO35*BP23),0)","v":0},null,null,null,null,"Datum vom",{"$f":"BY9+1","v":"2008-04-23"},"bis",null,{"$f":"IF(BY23=\"\",0,(BY23-BW23))","v":0},{"$f":"IF(BY35<>\"\",(BY35*BZ23),0)","v":0}]
[null,"kg","% errechnet","ca. % ","Klassen","Preis 1","€/kg",null,null,null,null,"kg","% errechnet","ca. % ","Klassen","Preis 1","€/kg",null,null,null,null,"kg","% errechnet","ca. % ","Klassen","Preis 1","€/kg",null,null,null,null,"kg","% errechnet","ca. % ","Klassen","Preis 1","€/kg",null,null,null,null,"kg","% errechnet","ca. % ","Klassen","Preis 1","€/kg",null,null,null,null,"kg","% errechnet","ca. % ","Klassen","Preis 1","€/kg",null,null,null,null,"kg","% errechnet","ca. % ","Klassen","Preis 1","€/kg",null,null,null,null,"kg","% errechnet","ca. % ","Klassen","Preis 1","€/kg"]
[null,1100,{"$f":"IF(B25>1,(B25/B$35*100),\"\")","v":41.666666666666671},null,"Klasse 1",6.9,{"$f":"IF(C25<>\"\",(F25*(C25/100)),F25*(D25/100))","v":2.8750000000000004},null,null,null,null,null,{"$f":"IF(L25>1,(L25/L$35*100),\"\")","v":""},null,null,null,{"$f":"IF(M25<>\"\",(P25*(M25/100)),P25*(N25/100))","v":0},null,null,null,null,null,{"$f":"IF(V25>1,(V25/V$35*100),\"\")","v":""},null,null,null,{"$f":"IF(W25<>\"\",(Z25*(W25/100)),Z25*(X25/100))","v":0},null,null,null,null,null,{"$f":"IF(AF25>1,(AF25/AF$35*100),\"\")","v":""},null,null,null,{"$f":"IF(AG25<>\"\",(AJ25*(AG25/100)),AJ25*(AH25/100))","v":0},null,null,null,null,null,{"$f":"IF(AP25>1,(AP25/AP$35*100),\"\")","v":""},null,null,null,{"$f":"IF(AQ25<>\"\",(AT25*(AQ25/100)),AT25*(AR25/100))","v":0},null,null,null,null,null,{"$f":"IF(AZ25>1,(AZ25/AZ$35*100),\"\")","v":""},null,null,null,{"$f":"IF(BA25<>\"\",(BD25*(BA25/100)),BD25*(BB25/100))","v":0},null,null,null,null,null,{"$f":"IF(BJ25>1,(BJ25/BJ$35*100),\"\")","v":""},null,null,null,{"$f":"IF(BK25<>\"\",(BN25*(BK25/100)),BN25*(BL25/100))","v":0},null,null,null,null,null,{"$f":"IF(BT25>1,(BT25/BT$35*100),\"\")","v":""},null,null,null,{"$f":"IF(BU25<>\"\",(BX25*(BU25/100)),BX25*(BV25/100))","v":0}]
[null,680,{"$f":"IF(B26>1,(B26/B$35*100),\"\")","v":25.757575757575758},null,"Klasse 1 vio",6.5,1.6742424242424243,null,null,null,null,null,{"$f":"IF(L26>1,(L26/L$35*100),\"\")","v":""},null,null,null,0,null,null,null,null,null,{"$f":"IF(V26>1,(V26/V$35*100),\"\")","v":""},null,null,null,0,null,null,null,null,null,{"$f":"IF(AF26>1,(AF26/AF$35*100),\"\")","v":""},null,null,null,0,null,null,null,null,null,{"$f":"IF(AP26>1,(AP26/AP$35*100),\"\")","v":""},null,null,null,0,null,null,null,null,null,{"$f":"IF(AZ26>1,(AZ26/AZ$35*100),\"\")","v":""},null,null,null,0,null,null,null,null,null,{"$f":"IF(BJ26>1,(BJ26/BJ$35*100),\"\")","v":""},null,null,null,0,null,null,null,null,null,{"$f":"IF(BT26>1,(BT26/BT$35*100),\"\")","v":""},null,null,null,0]
[null,600,22.727272727272727,null,"Klasse 2",6,1.3636363636363635,null,null,null,null,null,"",null,null,null,0,null,null,null,null,null,"",null,null,null,0,null,null,null,null,null,"",null,null,null,0,null,null,null,null,null,"",null,null,null,0,null,null,null,null,null,"",null,null,null,0,null,null,null,null,null,"",null,null,null,0,null,null,null,null,null,"",null,null,null,0]
[null,110,4.1666666666666661,null,"Klasse 2 vio",4,0.16666666666666663,null,null,null,null,null,"",null,null,null,0,null,null,null,null,null,"",null,null,null,0,null,null,null,null,null,"",null,null,null,0,null,null,null,null,null,"",null,null,null,0,null,null,null,null,null,"",null,null,null,0,null,null,null,null,null,"",null,null,null,0,null,null,null,null,null,"",null,null,null,0]
[null,65,2.4621212121212119,null,"Suppe",3,7.3863636363636354E-2,null,null,null,null,null,"",null,null,null,0,null,null,null,null,null,"",null,null,null,0,null,null,null,null,null,"",null,null,null,0,null,null,null,null,null,"",null,null,null,0,null,null,null,null,null,"",null,null,null,0,null,null,null,null,null,"",null,null,null,0,null,null,null,null,null,"",null,null,null,0]
[null,55,2.083333333333333,null,"Bruch",2.5,5.2083333333333322E-2,null,null,null,null,null,"",null,null,null,0,null,null,null,null,null,"",null,null,null,0,null,null,null,null,null,"",null,null,null,0,null,null,null,null,null,"",null,null,null,0,null,null,null,null,null,"",null,null,null,0,null,null,null,null,null,"",null,null,null,0,null,null,null,null,null,"",null,null,null,0]
[null,30,1.1363636363636365,null,"Spitzen",5,5.6818181818181823E-2,null,null,null,null,null,"",null,null,null,0,null,null,null,null,null,"",null,null,null,0,null,null,null,null,null,"",null,null,null,0,null,null,null,null,null,"",null,null,null,0,null,null,null,null,null,"",null,null,null,0,null,null,null,null,null,"",null,null,null,0,null,null,null,null,null,"",null,null,null,0]
[null,null,"",null,null,null,0,null,null,null,null,null,"",null,null,null,0,null,null,null,null,null,"",null,null,null,0,null,null,null,null,null,"",null,null,null,0,null,null,null,null,null,"",null,null,null,0,null,null,null,null,null,"",null,null,null,0,null,null,null,null,null,"",null,null,null,0,null,null,null,null,null,"",null,null,null,0]
[null,null,"",null,null,null,0,null,null,null,null,null,"",null,null,null,0,null,null,null,null,null,"",null,null,null,0,null,null,null,null,null,"",null,null,null,0,null,null,null,null,null,"",null,null,null,0,null,null,null,null,null,"",null,null,null,0,null,null,null,null,null,"",null,null,null,0,null,null,null,null,null,"",null,null,null,0]
[null,null,"",null,null,null,0,null,null,null,null,null,"",null,null,null,0,null,null,null,null,null,"",null,null,null,0,null,null,null,null,null,"",null,null,null,0,null,null,null,null,null,"",null,null,null,0,null,null,null,null,null,"",null,null,null,0,null,null,null,null,null,"",null,null,null,0,null,null,null,null,null,"",null,null,null,0]
[null,{"$f":"SUM(B25:B34)","v":2640},null,{"$f":"SUM(D25:D34)","v":0},null,null,{"$f":"IF(SUM(G25:G34)=0,\"\",(SUM(G25:G34)))","v":6.2623106060606064},null,null,null,null,{"$f":"SUM(L25:L34)","v":0},null,{"$f":"SUM(N25:N34)","v":0},null,null,{"$f":"IF(SUM(Q25:Q34)=0,\"\",(SUM(Q25:Q34)))","v":""},null,null,null,null,{"$f":"SUM(V25:V34)","v":0},null,{"$f":"SUM(X25:X34)","v":0},null,null,{"$f":"IF(SUM(AA25:AA34)=0,\"\",(SUM(AA25:AA34)))","v":""},null,null,null,null,{"$f":"SUM(AF25:AF34)","v":0},null,{"$f":"SUM(AH25:AH34)","v":0},null,null,{"$f":"IF(SUM(AK25:AK34)=0,\"\",(SUM(AK25:AK34)))","v":""},null,null,null,null,{"$f":"SUM(AP25:AP34)","v":0},null,{"$f":"SUM(AR25:AR34)","v":0},null,null,{"$f":"IF(SUM(AU25:AU34)=0,\"\",(SUM(AU25:AU34)))","v":""},null,null,null,null,{"$f":"SUM(AZ25:AZ34)","v":0},null,{"$f":"SUM(BB25:BB34)","v":0},null,null,{"$f":"IF(SUM(BE25:BE34)=0,\"\",(SUM(BE25:BE34)))","v":""},null,null,null,null,{"$f":"SUM(BJ25:BJ34)","v":0},null,{"$f":"SUM(BL25:BL34)","v":0},null,null,{"$f":"IF(SUM(BO25:BO34)=0,\"\",(SUM(BO25:BO34)))","v":""},null,null,null,null,{"$f":"SUM(BT25:BT34)","v":0},null,{"$f":"SUM(BV25:BV34)","v":0},null,null,{"$f":"IF(SUM(BY25:BY34)=0,\"\",(SUM(BY25:BY34)))","v":""}]
[null,{"$f":"IF(B35<1,\"\",B35/H23)","v":188.57142857142858},null,null,null,null,null,null,null,null,null,{"$f":"IF(L35<1,\"\",L35/R23)","v":""},null,null,null,null,null,null,null,null,null,{"$f":"IF(V35<1,\"\",V35/AB23)","v":""},null,null,null,null,null,null,null,null,null,{"$f":"IF(AF35<1,\"\",AF35/AL23)","v":""},null,null,null,null,null,null,null,null,null,{"$f":"IF(AP35<1,\"\",AP35/AV23)","v":""},null,null,null,null,null,null,null,null,null,{"$f":"IF(AZ35<1,\"\",AZ35/BF23)","v":""},null,null,null,null,null,null,null,null,null,{"$f":"IF(BJ35<1,\"\",BJ35/BP23)","v":""},null,null,null,null,null,null,null,null,null,{"$f":"IF(BT35<1,\"\",BT35/BZ23)","v":""}]
[null,null,null,"Datum vom",{"$f":"G23+1","v":"2008-05-08"},"bis","2008-05-15",{"$f":"IF(G37=\"\",0,(G37-E37))","v":7},{"$f":"IF(G49<>\"\",(G49*H37),0)","v":33.139240506329116},null,null,null,null,"Datum vom",{"$f":"Q23+1","v":"2008-05-19"},"bis",null,{"$f":"IF(Q37=\"\",0,(Q37-O37))","v":0},{"$f":"IF(Q49<>\"\",(Q49*R37),0)","v":0},null,null,null,null,"Datum vom",{"$f":"AA23+1","v":"1900-01-01"},"bis",null,{"$f":"IF(AA37=\"\",0,(AA37-Y37))","v":0},{"$f":"IF(AA49<>\"\",(AA49*AB37),0)","v":0},null,null,null,null,"Datum vom",{"$f":"AK23+1","v":"1900-01-01"},"bis",null,{"$f":"IF(AK37=\"\",0,(AK37-AI37))","v":0},{"$f":"IF(AK49<>\"\",(AK49*AL37),0)","v":0},null,null,null,null,"Datum vom",{"$f":"AU23+1","v":"1900-01-01"},"bis",null,{"$f":"IF(AU37=\"\",0,(AU37-AS37))","v":0},{"$f":"IF(AU49<>\"\",(AU49*AV37),0)","v":0},null,null,null,null,"Datum vom",{"$f":"BE23+1","v":"1900-01-01"},"bis",null,{"$f":"IF(BE37=\"\",0,(BE37-BC37))","v":0},{"$f":"IF(BE49<>\"\",(BE49*BF37),0)","v":0},null,null,null,null,"Datum vom",{"$f":"BO23+1","v":"1900-01-01"},"bis",null,{"$f":"IF(BO37=\"\",0,(BO37-BM37))","v":0},{"$f":"IF(BO49<>\"\",(BO49*BP37),0)","v":0},null,null,null,null,"Datum vom",{"$f":"BY23+1","v":"1900-01-01"},"bis",null,{"$f":"IF(BY37=\"\",0,(BY37-BW37))","v":0},{"$f":"IF(BY49<>\"\",(BY49*BZ37),0)","v":0}]
[null,"kg","% errechnet","ca. % ","Klassen","Preis 1","€/kg",null,null,null,null,"kg","% errechnet","ca. % ","Klassen","Preis 1","€/kg",null,null,null,null,"kg","% errechnet","ca. % ","Klassen","Preis 1","€/kg",null,null,null,null,"kg","% errechnet","ca. % ","Klassen","Preis 1","€/kg",null,null,null,null,"kg","% errechnet","ca. % ","Klassen","Preis 1","€/kg",null,null,null,null,"kg","% errechnet","ca. % ","Klassen","Preis 1","€/kg",null,null,null,null,"kg","% errechnet","ca. % ","Klassen","Preis 1","€/kg",null,null,null,null,"kg","% errechnet","ca. % ","Klassen","Preis 1","€/kg"]
[null,1480,{"$f":"IF(B39>1,(B39/B$49*100),\"\")","v":46.835443037974684},null,"Klasse 1",5.5,{"$f":"IF(C39<>\"\",(F39*(C39/100)),F39*(D39/100))","v":2.5759493670886076},null,null,null,null,null,{"$f":"IF(L39>1,(L39/L$49*100),\"\")","v":""},null,null,null,{"$f":"IF(M39<>\"\",(P39*(M39/100)),P39*(N39/100))","v":0},null,null,null,null,null,{"$f":"IF(V39>1,(V39/V$49*100),\"\")","v":""},null,null,null,{"$f":"IF(W39<>\"\",(Z39*(W39/100)),Z39*(X39/100))","v":0},null,null,null,null,null,{"$f":"IF(AF39>1,(AF39/AF$49*100),\"\")","v":""},null,null,null,{"$f":"IF(AG39<>\"\",(AJ39*(AG39/100)),AJ39*(AH39/100))","v":0},null,null,null,null,null,{"$f":"IF(AP39>1,(AP39/AP$49*100),\"\")","v":""},null,null,null,{"$f":"IF(AQ39<>\"\",(AT39*(AQ39/100)),AT39*(AR39/100))","v":0},null,null,null,null,null,{"$f":"IF(AZ39>1,(AZ39/AZ$49*100),\"\")","v":""},null,null,null,{"$f":"IF(BA39<>\"\",(BD39*(BA39/100)),BD39*(BB39/100))","v":0},null,null,null,null,null,{"$f":"IF(BJ39>1,(BJ39/BJ$49*100),\"\")","v":""},null,null,null,{"$f":"IF(BK39<>\"\",(BN39*(BK39/100)),BN39*(BL39/100))","v":0},null,null,null,null,null,{"$f":"IF(BT39>1,(BT39/BT$49*100),\"\")","v":""},null,null,null,{"$f":"IF(BU39<>\"\",(BX39*(BU39/100)),BX39*(BV39/100))","v":0}]
[null,490,{"$f":"IF(B40>1,(B40/B$49*100),\"\")","v":15.50632911392405},null,"Klasse 1 vio",4.5,0.69778481012658222,null,null,null,null,null,{"$f":"IF(L40>1,(L40/L$49*100),\"\")","v":""},null,null,null,0,null,null,null,null,null,{"$f":"IF(V40>1,(V40/V$49*100),\"\")","v":""},null,null,null,0,null,null,null,null,null,{"$f":"IF(AF40>1,(AF40/AF$49*100),\"\")","v":""},null,null,null,0,null,null,null,null,null,{"$f":"IF(AP40>1,(AP40/AP$49*100),\"\")","v":""},null,null,null,0,null,null,null,null,null,{"$f":"IF(AZ40>1,(AZ40/AZ$49*100),\"\")","v":""},null,null,null,0,null,null,null,null,null,{"$f":"IF(BJ40>1,(BJ40/BJ$49*100),\"\")","v":""},null,null,null,0,null,null,null,null,null,{"$f":"IF(BT40>1,(BT40/BT$49*100),\"\")","v":""},null,null,null,0]
[null,900,28.481012658227851,null,"Klasse 2",4,1.139240506329114,null,null,null,null,null,"",null,null,null,0,null,null,null,null,null,"",null,null,null,0,null,null,null,null,null,"",null,null,null,0,null,null,null,null,null,"",null,null,null,0,null,null,null,null,null,"",null,null,null,0,null,null,null,null,null,"",null,null,null,0,null,null,null,null,null,"",null,null,null,0]
[null,100,3.1645569620253164,null,"Klasse 2 vio",4,0.12658227848101267,null,null,null,null,null,"",null,null,null,0,null,null,null,null,null,"",null,null,null,0,null,null,null,null,null,"",null,null,null,0,null,null,null,null,null,"",null,null,null,0,null,null,null,null,null,"",null,null,null,0,null,null,null,null,null,"",null,null,null,0,null,null,null,null,null,"",null,null,null,0]
[null,80,2.5316455696202533,null,"Suppe",3,7.5949367088607611E-2,null,null,null,null,null,"",null,null,null,0,null,null,null,null,null,"",null,null,null,0,null,null,null,null,null,"",null,null,null,0,null,null,null,null,null,"",null,null,null,0,null,null,null,null,null,"",null,null,null,0,null,null,null,null,null,"",null,null,null,0,null,null,null,null,null,"",null,null,null,0]
[null,70,2.2151898734177213,null,"Bruch",2.5,5.5379746835443028E-2,null,null,null,null,null,"",null,null,null,0,null,null,null,null,null,"",null,null,null,0,null,null,null,null,null,"",null,null,null,0,null,null,null,null,null,"",null,null,null,0,null,null,null,null,null,"",null,null,null,0,null,null,null,null,null,"",null,null,null,0,null,null,null,null,null,"",null,null,null,0]
[null,40,1.2658227848101267,null,"Spitzen",5,6.3291139240506333E-2,null,null,null,null,null,"",null,null,null,0,null,null,null,null,null,"",null,null,null,0,null,null,null,null,null,"",null,null,null,0,null,null,null,null,null,"",null,null,null,0,null,null,null,null,null,"",null,null,null,0,null,null,null,null,null,"",null,null,null,0,null,null,null,null,null,"",null,null,null,0]
[null,null,"",null,null,null,0,null,null,null,null,null,"",null,null,null,0,null,null,null,null,null,"",null,null,null,0,null,null,null,null,null,"",null,null,null,0,null,null,null,null,null,"",null,null,null,0,null,null,null,null,null,"",null,null,null,0,null,null,null,null,null,"",null,null,null,0,null,null,null,null,null,"",null,null,null,0]
[null,null,"",null,null,null,0,null,null,null,null,null,"",null,null,null,0,null,null,null,null,null,"",null,null,null,0,null,null,null,null,null,"",null,null,null,0,null,null,null,null,null,"",null,null,null,0,null,null,null,null,null,"",null,null,null,0,null,null,null,null,null,"",null,null,null,0,null,null,null,null,null,"",null,null,null,0]
[null,null,"",null,null,null,0,null,null,null,null,null,"",null,null,null,0,null,null,null,null,null,"",null,null,null,0,null,null,null,null,null,"",null,null,null,0,null,null,null,null,null,"",null,null,null,0,null,null,null,null,null,"",null,null,null,0,null,null,null,null,null,"",null,null,null,0,null,null,null,null,null,"",null,null,null,0]
[null,{"$f":"SUM(B39:B48)","v":3160},null,{"$f":"SUM(D39:D48)","v":0},null,null,{"$f":"IF(SUM(G39:G48)=0,\"\",(SUM(G39:G48)))","v":4.7341772151898738},null,null,null,null,{"$f":"SUM(L39:L48)","v":0},null,{"$f":"SUM(N39:N48)","v":0},null,null,{"$f":"IF(SUM(Q39:Q48)=0,\"\",(SUM(Q39:Q48)))","v":""},null,null,null,null,{"$f":"SUM(V39:V48)","v":0},null,{"$f":"SUM(X39:X48)","v":0},null,null,{"$f":"IF(SUM(AA39:AA48)=0,\"\",(SUM(AA39:AA48)))","v":""},null,null,null,null,{"$f":"SUM(AF39:AF48)","v":0},null,{"$f":"SUM(AH39:AH48)","v":0},null,null,{"$f":"IF(SUM(AK39:AK48)=0,\"\",(SUM(AK39:AK48)))","v":""},null,null,null,null,{"$f":"SUM(AP39:AP48)","v":0},null,{"$f":"SUM(AR39:AR48)","v":0},null,null,{"$f":"IF(SUM(AU39:AU48)=0,\"\",(SUM(AU39:AU48)))","v":""},null,null,null,null,{"$f":"SUM(AZ39:AZ48)","v":0},null,{"$f":"SUM(BB39:BB48)","v":0},null,null,{"$f":"IF(SUM(BE39:BE48)=0,\"\",(SUM(BE39:BE48)))","v":""},null,null,null,null,{"$f":"SUM(BJ39:BJ48)","v":0},null,{"$f":"SUM(BL39:BL48)","v":0},null,null,{"$f":"IF(SUM(BO39:BO48)=0,\"\",(SUM(BO39:BO48)))","v":""},null,null,null,null,{"$f":"SUM(BT39:BT48)","v":0},null,{"$f":"SUM(BV39:BV48)","v":0},null,null,{"$f":"IF(SUM(BY39:BY48)=0,\"\",(SUM(BY39:BY48)))","v":""}]
[null,{"$f":"IF(B49<1,\"\",B49/H37)","v":451.42857142857144},null,null,null,null,null,null,null,null,null,{"$f":"IF(L49<1,\"\",L49/R37)","v":""},null,null,null,null,null,null,null,null,null,{"$f":"IF(V49<1,\"\",V49/AB37)","v":""},null,null,null,null,null,null,null,null,null,{"$f":"IF(AF49<1,\"\",AF49/AL37)","v":""},null,null,null,null,null,null,null,null,null,{"$f":"IF(AP49<1,\"\",AP49/AV37)","v":""},null,null,null,null,null,null,null,null,null,{"$f":"IF(AZ49<1,\"\",AZ49/BF37)","v":""},null,null,null,null,null,null,null,null,null,{"$f":"IF(BJ49<1,\"\",BJ49/BP37)","v":""},null,null,null,null,null,null,null,null,null,{"$f":"IF(BT49<1,\"\",BT49/BZ37)","v":""}]
[null,null,null,"Datum vom",{"$f":"G37+1","v":"2008-05-16"},"bis","2008-06-05",{"$f":"IF(G51=\"\",0,(G51-E51))","v":20},{"$f":"IF(G63<>\"\",(G63*H51),0)","v":82.904761904761898},null,null,null,null,"Datum vom",{"$f":"Q37+1","v":"1900-01-01"},"bis",null,{"$f":"IF(Q51=\"\",0,(Q51-O51))","v":0},{"$f":"IF(Q63<>\"\",(Q63*R51),0)","v":0},null,null,null,null,"Datum vom",{"$f":"AA37+1","v":"1900-01-01"},"bis",null,{"$f":"IF(AA51=\"\",0,(AA51-Y51))","v":0},{"$f":"IF(AA63<>\"\",(AA63*AB51),0)","v":0},null,null,null,null,"Datum vom",{"$f":"AK37+1","v":"1900-01-01"},"bis",null,{"$f":"IF(AK51=\"\",0,(AK51-AI51))","v":0},{"$f":"IF(AK63<>\"\",(AK63*AL51),0)","v":0},null,null,null,null,"Datum vom",{"$f":"AU37+1","v":"1900-01-01"},"bis",null,{"$f":"IF(AU51=\"\",0,(AU51-AS51))","v":0},{"$f":"IF(AU63<>\"\",(AU63*AV51),0)","v":0},null,null,null,null,"Datum vom",{"$f":"BE37+1","v":"1900-01-01"},"bis",null,{"$f":"IF(BE51=\"\",0,(BE51-BC51))","v":0},{"$f":"IF(BE63<>\"\",(BE63*BF51),0)","v":0},null,null,null,null,"Datum vom",{"$f":"BO37+1","v":"1900-01-01"},"bis",null,{"$f":"IF(BO51=\"\",0,(BO51-BM51))","v":0},{"$f":"IF(BO63<>\"\",(BO63*BP51),0)","v":0},null,null,null,null,"Datum vom",{"$f":"BY37+1","v":"1900-01-01"},"bis",null,{"$f":"IF(BY51=\"\",0,(BY51-BW51))","v":0},{"$f":"IF(BY63<>\"\",(BY63*BZ51),0)","v":0}]
[null,"kg","% errechnet","ca. % ","Klassen","Preis 1","€/kg",null,null,null,null,"kg","% errechnet","ca. % ","Klassen","Preis 1","€/kg",null,null,null,null,"kg","% errechnet","ca. % ","Klassen","Preis 1","€/kg",null,null,null,null,"kg","% errechnet","ca. % ","Klassen","Preis 1","€/kg",null,null,null,null,"kg","% errechnet","ca. % ","Klassen","Preis 1","€/kg",null,null,null,null,"kg","% errechnet","ca. % ","Klassen","Preis 1","€/kg",null,null,null,null,"kg","% errechnet","ca. % ","Klassen","Preis 1","€/kg",null,null,null,null,"kg","% errechnet","ca. % ","Klassen","Preis 1","€/kg"]
[null,2400,{"$f":"IF(B53>1,(B53/B$63*100),\"\")","v":38.095238095238095},null,"Klasse 1",5,{"$f":"IF(C53<>\"\",(F53*(C53/100)),F53*(D53/100))","v":1.9047619047619047},null,null,null,null,null,{"$f":"IF(L53>1,(L53/L$63*100),\"\")","v":""},null,null,null,{"$f":"IF(M53<>\"\",(P53*(M53/100)),P53*(N53/100))","v":0},null,null,null,null,null,{"$f":"IF(V53>1,(V53/V$63*100),\"\")","v":""},null,null,null,{"$f":"IF(W53<>\"\",(Z53*(W53/100)),Z53*(X53/100))","v":0},null,null,null,null,null,{"$f":"IF(AF53>1,(AF53/AF$63*100),\"\")","v":""},null,null,null,{"$f":"IF(AG53<>\"\",(AJ53*(AG53/100)),AJ53*(AH53/100))","v":0},null,null,null,null,null,{"$f":"IF(AP53>1,(AP53/AP$63*100),\"\")","v":""},null,null,null,{"$f":"IF(AQ53<>\"\",(AT53*(AQ53/100)),AT53*(AR53/100))","v":0},null,null,null,null,null,{"$f":"IF(AZ53>1,(AZ53/AZ$63*100),\"\")","v":""},null,null,null,{"$f":"IF(BA53<>\"\",(BD53*(BA53/100)),BD53*(BB53/100))","v":0},null,null,null,null,null,{"$f":"IF(BJ53>1,(BJ53/BJ$63*100),\"\")","v":""},null,null,null,{"$f":"IF(BK53<>\"\",(BN53*(BK53/100)),BN53*(BL53/100))","v":0},null,null,null,null,null,{"$f":"IF(BT53>1,(BT53/BT$63*100),\"\")","v":""},null,null,null,{"$f":"IF(BU53<>\"\",(BX53*(BU53/100)),BX53*(BV53/100))","v":0}]
[null,1600,{"$f":"IF(B54>1,(B54/B$63*100),\"\")","v":25.396825396825395},null,"Klasse 1 vio",4.5,1.1428571428571428,null,null,null,null,null,{"$f":"IF(L54>1,(L54/L$63*100),\"\")","v":""},null,null,null,0,null,null,null,null,null,{"$f":"IF(V54>1,(V54/V$63*100),\"\")","v":""},null,null,null,0,null,null,null,null,null,{"$f":"IF(AF54>1,(AF54/AF$63*100),\"\")","v":""},null,null,null,0,null,null,null,null,null,{"$f":"IF(AP54>1,(AP54/AP$63*100),\"\")","v":""},null,null,null,0,null,null,null,null,null,{"$f":"IF(AZ54>1,(AZ54/AZ$63*100),\"\")","v":""},null,null,null,0,null,null,null,null,null,{"$f":"IF(BJ54>1,(BJ54/BJ$63*100),\"\")","v":""},null,null,null,0,null,null,null,null,null,{"$f":"IF(BT54>1,(BT54/BT$63*100),\"\")","v":""},null,null,null,0]
[null,1300,20.634920634920633,null,"Klasse 2",3.5,0.72222222222222221,null,null,null,null,null,"",null,null,null,0,null,null,null,null,null,"",null,null,null,0,null,null,null,null,null,"",null,null,null,0,null,null,null,null,null,"",null,null,null,0,null,null,null,null,null,"",null,null,null,0,null,null,null,null,null,"",null,null,null,0,null,null,null,null,null,"",null,null,null,0]
[null,400,6.3492063492063489,null,"Klasse 2 vio",3,0.19047619047619047,null,null,null,null,null,"",null,null,null,0,null,null,null,null,null,"",null,null,null,0,null,null,null,null,null,"",null,null,null,0,null,null,null,null,null,"",null,null,null,0,null,null,null,null,null,"",null,null,null,0,null,null,null,null,null,"",null,null,null,0,null,null,null,null,null,"",null,null,null,0]
[null,350,5.5555555555555554,null,"Suppe",2,0.1111111111111111,null,null,null,null,null,"",null,null,null,0,null,null,null,null,null,"",null,null,null,0,null,null,null,null,null,"",null,null,null,0,null,null,null,null,null,"",null,null,null,0,null,null,null,null,null,"",null,null,null,0,null,null,null,null,null,"",null,null,null,0,null,null,null,null,null,"",null,null,null,0]
[null,190,3.0158730158730158,null,"Bruch",1.5,4.5238095238095237E-2,null,null,null,null,null,"",null,null,null,0,null,null,null,null,null,"",null,null,null,0,null,null,null,null,null,"",null,null,null,0,null,null,null,null,null,"",null,null,null,0,null,null,null,null,null,"",null,null,null,0,null,null,null,null,null,"",null,null,null,0,null,null,null,null,null,"",null,null,null,0]
[null,60,0.95238095238095244,null,"Spitzen",3,2.8571428571428574E-2,null,null,null,null,null,"",null,null,null,0,null,null,null,null,null,"",null,null,null,0,null,null,null,null,null,"",null,null,null,0,null,null,null,null,null,"",null,null,null,0,null,null,null,null,null,"",null,null,null,0,null,null,null,null,null,"",null,null,null,0,null,null,null,null,null,"",null,null,null,0]
[null,null,"",null,null,null,0,null,null,null,null,null,"",null,null,null,0,null,null,null,null,null,"",null,null,null,0,null,null,null,null,null,"",null,null,null,0,null,null,null,null,null,"",null,null,null,0,null,null,null,null,null,"",null,null,null,0,null,null,null,null,null,"",null,null,null,0,null,null,null,null,null,"",null,null,null,0]
[null,null,"",null,null,null,0,null,null,null,null,null,"",null,null,null,0,null,null,null,null,null,"",null,null,null,0,null,null,null,null,null,"",null,null,null,0,null,null,null,null,null,"",null,null,null,0,null,null,null,null,null,"",null,null,null,0,null,null,null,null,null,"",null,null,null,0,null,null,null,null,null,"",null,null,null,0]
[null,null,"",null,null,null,0,null,null,null,null,null,"",null,null,null,0,null,null,null,null,null,"",null,null,null,0,null,null,null,null,null,"",null,null,null,0,null,null,null,null,null,"",null,null,null,0,null,null,null,null,null,"",null,null,null,0,null,null,null,null,null,"",null,null,null,0,null,null,null,null,null,"",null,null,null,0]
[null,{"$f":"SUM(B53:B62)","v":6300},null,{"$f":"SUM(D53:D62)","v":0},null,null,{"$f":"IF(SUM(G53:G62)=0,\"\",(SUM(G53:G62)))","v":4.1452380952380947},null,null,null,null,{"$f":"SUM(L53:L62)","v":0},null,{"$f":"SUM(N53:N62)","v":0},null,null,{"$f":"IF(SUM(Q53:Q62)=0,\"\",(SUM(Q53:Q62)))","v":""},null,null,null,null,{"$f":"SUM(V53:V62)","v":0},null,{"$f":"SUM(X53:X62)","v":0},null,null,{"$f":"IF(SUM(AA53:AA62)=0,\"\",(SUM(AA53:AA62)))","v":""},null,null,null,null,{"$f":"SUM(AF53:AF62)","v":0},null,{"$f":"SUM(AH53:AH62)","v":0},null,null,{"$f":"IF(SUM(AK53:AK62)=0,\"\",(SUM(AK53:AK62)))","v":""},null,null,null,null,{"$f":"SUM(AP53:AP62)","v":0},null,{"$f":"SUM(AR53:AR62)","v":0},null,null,{"$f":"IF(SUM(AU53:AU62)=0,\"\",(SUM(AU53:AU62)))","v":""},null,null,null,null,{"$f":"SUM(AZ53:AZ62)","v":0},null,{"$f":"SUM(BB53:BB62)","v":0},null,null,{"$f":"IF(SUM(BE53:BE62)=0,\"\",(SUM(BE53:BE62)))","v":""},null,null,null,null,{"$f":"SUM(BJ53:BJ62)","v":0},null,{"$f":"SUM(BL53:BL62)","v":0},null,null,{"$f":"IF(SUM(BO53:BO62)=0,\"\",(SUM(BO53:BO62)))","v":""},null,null,null,null,{"$f":"SUM(BT53:BT62)","v":0},null,{"$f":"SUM(BV53:BV62)","v":0},null,null,{"$f":"IF(SUM(BY53:BY62)=0,\"\",(SUM(BY53:BY62)))","v":""}]
[null,{"$f":"IF(B63<1,\"\",B63/H51)","v":315},null,null,null,null,null,null,null,null,null,{"$f":"IF(L63<1,\"\",L63/R51)","v":""},null,null,null,null,null,null,null,null,null,{"$f":"IF(V63<1,\"\",V63/AB51)","v":""},null,null,null,null,null,null,null,null,null,{"$f":"IF(AF63<1,\"\",AF63/AL51)","v":""},null,null,null,null,null,null,null,null,null,{"$f":"IF(AP63<1,\"\",AP63/AV51)","v":""},null,null,null,null,null,null,null,null,null,{"$f":"IF(AZ63<1,\"\",AZ63/BF51)","v":""},null,null,null,null,null,null,null,null,null,{"$f":"IF(BJ63<1,\"\",BJ63/BP51)","v":""},null,null,null,null,null,null,null,null,null,{"$f":"IF(BT63<1,\"\",BT63/BZ51)","v":""}]
[null,null,null,"Datum vom",{"$f":"G51+1","v":"2008-06-06"},"bis","2008-06-25",{"$f":"IF(G65=\"\",0,(G65-E65))","v":19},{"$f":"IF(G77<>\"\",(G77*H65),0)","v":73.322110746671825},null,null,null,null,"Datum vom",{"$f":"Q51+1","v":"1900-01-01"},"bis",null,{"$f":"IF(Q65=\"\",0,(Q65-O65))","v":0},{"$f":"IF(Q77<>\"\",(Q77*R65),0)","v":0},null,null,null,null,"Datum vom",{"$f":"AA51+1","v":"1900-01-01"},"bis",null,{"$f":"IF(AA65=\"\",0,(AA65-Y65))","v":0},{"$f":"IF(AA77<>\"\",(AA77*AB65),0)","v":0},null,null,null,null,"Datum vom",{"$f":"AK51+1","v":"1900-01-01"},"bis",null,{"$f":"IF(AK65=\"\",0,(AK65-AI65))","v":0},{"$f":"IF(AK77<>\"\",(AK77*AL65),0)","v":0},null,null,null,null,"Datum vom",{"$f":"AU51+1","v":"1900-01-01"},"bis",null,{"$f":"IF(AU65=\"\",0,(AU65-AS65))","v":0},{"$f":"IF(AU77<>\"\",(AU77*AV65),0)","v":0},null,null,null,null,"Datum vom",{"$f":"BE51+1","v":"1900-01-01"},"bis",null,{"$f":"IF(BE65=\"\",0,(BE65-BC65))","v":0},{"$f":"IF(BE77<>\"\",(BE77*BF65),0)","v":0},null,null,null,null,"Datum vom",{"$f":"BO51+1","v":"1900-01-01"},"bis",null,{"$f":"IF(BO65=\"\",0,(BO65-BM65))","v":0},{"$f":"IF(BO77<>\"\",(BO77*BP65),0)","v":0},null,null,null,null,"Datum vom",{"$f":"BY51+1","v":"1900-01-01"},"bis",null,{"$f":"IF(BY65=\"\",0,(BY65-BW65))","v":0},{"$f":"IF(BY77<>\"\",(BY77*BZ65),0)","v":0}]
[null,"kg","% errechnet","ca. % ","Klassen","Preis 1","€/kg",null,null,null,null,"kg","% errechnet","ca. % ","Klassen","Preis 1","€/kg",null,null,null,null,"kg","% errechnet","ca. % ","Klassen","Preis 1","€/kg",null,null,null,null,"kg","% errechnet","ca. % ","Klassen","Preis 1","€/kg",null,null,null,null,"kg","% errechnet","ca. % ","Klassen","Preis 1","€/kg",null,null,null,null,"kg","% errechnet","ca. % ","Klassen","Preis 1","€/kg",null,null,null,null,"kg","% errechnet","ca. % ","Klassen","Preis 1","€/kg",null,null,null,null,"kg","% errechnet","ca. % ","Klassen","Preis 1","€/kg"]
[null,2200,{"$f":"IF(B67>1,(B67/B$77*100),\"\")","v":42.446459579394173},null,"Klasse 1",4.9000000000000004,{"$f":"IF(C67<>\"\",(F67*(C67/100)),F67*(D67/100))","v":2.0798765193903148},null,null,null,null,null,{"$f":"IF(L67>1,(L67/L$77*100),\"\")","v":""},null,null,null,{"$f":"IF(M67<>\"\",(P67*(M67/100)),P67*(N67/100))","v":0},null,null,null,null,null,{"$f":"IF(V67>1,(V67/V$77*100),\"\")","v":""},null,null,null,{"$f":"IF(W67<>\"\",(Z67*(W67/100)),Z67*(X67/100))","v":0},null,null,null,null,null,{"$f":"IF(AF67>1,(AF67/AF$77*100),\"\")","v":""},null,null,null,{"$f":"IF(AG67<>\"\",(AJ67*(AG67/100)),AJ67*(AH67/100))","v":0},null,null,null,null,null,{"$f":"IF(AP67>1,(AP67/AP$77*100),\"\")","v":""},null,null,null,{"$f":"IF(AQ67<>\"\",(AT67*(AQ67/100)),AT67*(AR67/100))","v":0},null,null,null,null,null,{"$f":"IF(AZ67>1,(AZ67/AZ$77*100),\"\")","v":""},null,null,null,{"$f":"IF(BA67<>\"\",(BD67*(BA67/100)),BD67*(BB67/100))","v":0},null,null,null,null,null,{"$f":"IF(BJ67>1,(BJ67/BJ$77*100),\"\")","v":""},null,null,null,{"$f":"IF(BK67<>\"\",(BN67*(BK67/100)),BN67*(BL67/100))","v":0},null,null,null,null,null,{"$f":"IF(BT67>1,(BT67/BT$77*100),\"\")","v":""},null,null,null,{"$f":"IF(BU67<>\"\",(BX67*(BU67/100)),BX67*(BV67/100))","v":0}]
[null,800,{"$f":"IF(B68>1,(B68/B$77*100),\"\")","v":15.43507621068879},null,"Klasse 1 vio",4,0.61740304842755156,null,null,null,null,null,{"$f":"IF(L68>1,(L68/L$77*100),\"\")","v":""},null,null,null,0,null,null,null,null,null,{"$f":"IF(V68>1,(V68/V$77*100),\"\")","v":""},null,null,null,0,null,null,null,null,null,{"$f":"IF(AF68>1,(AF68/AF$77*100),\"\")","v":""},null,null,null,0,null,null,null,null,null,{"$f":"IF(AP68>1,(AP68/AP$77*100),\"\")","v":""},null,null,null,0,null,null,null,null,null,{"$f":"IF(AZ68>1,(AZ68/AZ$77*100),\"\")","v":""},null,null,null,0,null,null,null,null,null,{"$f":"IF(BJ68>1,(BJ68/BJ$77*100),\"\")","v":""},null,null,null,0,null,null,null,null,null,{"$f":"IF(BT68>1,(BT68/BT$77*100),\"\")","v":""},null,null,null,0]
[null,1500,28.940767895041482,null,"Klasse 2",3,0.86822303685124447,null,null,null,null,null,"",null,null,null,0,null,null,null,null,null,"",null,null,null,0,null,null,null,null,null,"",null,null,null,0,null,null,null,null,null,"",null,null,null,0,null,null,null,null,null,"",null,null,null,0,null,null,null,null,null,"",null,null,null,0,null,null,null,null,null,"",null,null,null,0]
[null,400,7.7175381053443948,null,"Klasse 2 vio",2.5,0.19293845263360987,null,null,null,null,null,"",null,null,null,0,null,null,null,null,null,"",null,null,null,0,null,null,null,null,null,"",null,null,null,0,null,null,null,null,null,"",null,null,null,0,null,null,null,null,null,"",null,null,null,0,null,null,null,null,null,"",null,null,null,0,null,null,null,null,null,"",null,null,null,0]
[null,125,2.4117306579201232,null,"Suppe",1.5,3.617595986880185E-2,null,null,null,null,null,"",null,null,null,0,null,null,null,null,null,"",null,null,null,0,null,null,null,null,null,"",null,null,null,0,null,null,null,null,null,"",null,null,null,0,null,null,null,null,null,"",null,null,null,0,null,null,null,null,null,"",null,null,null,0,null,null,null,null,null,"",null,null,null,0]
[null,70,1.3505691684352692,null,"Bruch",1,1.3505691684352693E-2,null,null,null,null,null,"",null,null,null,0,null,null,null,null,null,"",null,null,null,0,null,null,null,null,null,"",null,null,null,0,null,null,null,null,null,"",null,null,null,0,null,null,null,null,null,"",null,null,null,0,null,null,null,null,null,"",null,null,null,0,null,null,null,null,null,"",null,null,null,0]
[null,88,1.6978583831757668,null,"Spitzen",3,5.0935751495273004E-2,null,null,null,null,null,"",null,null,null,0,null,null,null,null,null,"",null,null,null,0,null,null,null,null,null,"",null,null,null,0,null,null,null,null,null,"",null,null,null,0,null,null,null,null,null,"",null,null,null,0,null,null,null,null,null,"",null,null,null,0,null,null,null,null,null,"",null,null,null,0]
[null,null,"",null,null,null,0,null,null,null,null,null,"",null,null,null,0,null,null,null,null,null,"",null,null,null,0,null,null,null,null,null,"",null,null,null,0,null,null,null,null,null,"",null,null,null,0,null,null,null,null,null,"",null,null,null,0,null,null,null,null,null,"",null,null,null,0,null,null,null,null,null,"",null,null,null,0]
[null,null,"",null,null,null,0,null,null,null,null,null,"",null,null,null,0,null,null,null,null,null,"",null,null,null,0,null,null,null,null,null,"",null,null,null,0,null,null,null,null,null,"",null,null,null,0,null,null,null,null,null,"",null,null,null,0,null,null,null,null,null,"",null,null,null,0,null,null,null,null,null,"",null,null,null,0]
[null,null,{"$f":"IF(B76>1,(B76/$B$77*100),\"\")","v":""},null,null,null,0,null,null,null,null,null,{"$f":"IF(L76>1,(L76/$B$77*100),\"\")","v":""},null,null,null,0,null,null,null,null,null,{"$f":"IF(V76>1,(V76/$B$77*100),\"\")","v":""},null,null,null,0,null,null,null,null,null,{"$f":"IF(AF76>1,(AF76/$B$77*100),\"\")","v":""},null,null,null,0,null,null,null,null,null,{"$f":"IF(AP76>1,(AP76/$B$77*100),\"\")","v":""},null,null,null,0,null,null,null,null,null,{"$f":"IF(AZ76>1,(AZ76/$B$77*100),\"\")","v":""},null,null,null,0,null,null,null,null,null,{"$f":"IF(BJ76>1,(BJ76/$B$77*100),\"\")","v":""},null,null,null,0,null,null,null,null,null,{"$f":"IF(BT76>1,(BT76/$B$77*100),\"\")","v":""},null,null,null,0]
[null,{"$f":"SUM(B67:B76)","v":5183},null,{"$f":"SUM(D67:D76)","v":0},null,null,{"$f":"IF(SUM(G67:G76)=0,\"\",(SUM(G67:G76)))","v":3.8590584603511484},null,null,null,null,{"$f":"SUM(L67:L76)","v":0},null,{"$f":"SUM(N67:N76)","v":0},null,null,{"$f":"IF(SUM(Q67:Q76)=0,\"\",(SUM(Q67:Q76)))","v":""},null,null,null,null,{"$f":"SUM(V67:V76)","v":0},null,{"$f":"SUM(X67:X76)","v":0},null,null,{"$f":"IF(SUM(AA67:AA76)=0,\"\",(SUM(AA67:AA76)))","v":""},null,null,null,null,{"$f":"SUM(AF67:AF76)","v":0},null,{"$f":"SUM(AH67:AH76)","v":0},null,null,{"$f":"IF(SUM(AK67:AK76)=0,\"\",(SUM(AK67:AK76)))","v":""},null,null,null,null,{"$f":"SUM(AP67:AP76)","v":0},null,{"$f":"SUM(AR67:AR76)","v":0},null,null,{"$f":"IF(SUM(AU67:AU76)=0,\"\",(SUM(AU67:AU76)))","v":""},null,null,null,null,{"$f":"SUM(AZ67:AZ76)","v":0},null,{"$f":"SUM(BB67:BB76)","v":0},null,null,{"$f":"IF(SUM(BE67:BE76)=0,\"\",(SUM(BE67:BE76)))","v":""},null,null,null,null,{"$f":"SUM(BJ67:BJ76)","v":0},null,{"$f":"SUM(BL67:BL76)","v":0},null,null,{"$f":"IF(SUM(BO67:BO76)=0,\"\",(SUM(BO67:BO76)))","v":""},null,null,null,null,{"$f":"SUM(BT67:BT76)","v":0},null,{"$f":"SUM(BV67:BV76)","v":0},null,null,{"$f":"IF(SUM(BY67:BY76)=0,\"\",(SUM(BY67:BY76)))","v":""}]
[null,{"$f":"IF(B77<1,\"\",B77/H65)","v":272.78947368421052},null,null,null,null,null,null,null,null,null,{"$f":"IF(L77<1,\"\",L77/R65)","v":""},null,null,null,null,null,null,null,null,null,{"$f":"IF(V77<1,\"\",V77/AB65)","v":""},null,null,null,null,null,null,null,null,null,{"$f":"IF(AF77<1,\"\",AF77/AL65)","v":""},null,null,null,null,null,null,null,null,null,{"$f":"IF(AP77<1,\"\",AP77/AV65)","v":""},null,null,null,null,null,null,null,null,null,{"$f":"IF(AZ77<1,\"\",AZ77/BF65)","v":""},null,null,null,null,null,null,null,null,null,{"$f":"IF(BJ77<1,\"\",BJ77/BP65)","v":""},null,null,null,null,null,null,null,null,null,{"$f":"IF(BT77<1,\"\",BT77/BZ65)","v":""}]
[null,null,null,"Datum vom",{"$f":"G65+1","v":"2008-06-26"},"bis",null,{"$f":"IF(G79=\"\",0,(G79-E79))","v":0},{"$f":"IF(G91<>\"\",(G91*H79),0)","v":0},null,null,null,null,"Datum vom",{"$f":"Q65+1","v":"1900-01-01"},"bis",null,{"$f":"IF(Q79=\"\",0,(Q79-O79))","v":0},{"$f":"IF(Q91<>\"\",(Q91*R79),0)","v":0},null,null,null,null,"Datum vom",{"$f":"AA65+1","v":"1900-01-01"},"bis",null,{"$f":"IF(AA79=\"\",0,(AA79-Y79))","v":0},{"$f":"IF(AA91<>\"\",(AA91*AB79),0)","v":0},null,null,null,null,"Datum vom",{"$f":"AK65+1","v":"1900-01-01"},"bis",null,{"$f":"IF(AK79=\"\",0,(AK79-AI79))","v":0},{"$f":"IF(AK91<>\"\",(AK91*AL79),0)","v":0},null,null,null,null,"Datum vom",{"$f":"AU65+1","v":"1900-01-01"},"bis",null,{"$f":"IF(AU79=\"\",0,(AU79-AS79))","v":0},{"$f":"IF(AU91<>\"\",(AU91*AV79),0)","v":0},null,null,null,null,"Datum vom",{"$f":"BE65+1","v":"1900-01-01"},"bis",null,{"$f":"IF(BE79=\"\",0,(BE79-BC79))","v":0},{"$f":"IF(BE91<>\"\",(BE91*BF79),0)","v":0},null,null,null,null,"Datum vom",{"$f":"BO65+1","v":"1900-01-01"},"bis",null,{"$f":"IF(BO79=\"\",0,(BO79-BM79))","v":0},{"$f":"IF(BO91<>\"\",(BO91*BP79),0)","v":0},null,null,null,null,"Datum vom",{"$f":"BY65+1","v":"1900-01-01"},"bis",null,{"$f":"IF(BY79=\"\",0,(BY79-BW79))","v":0},{"$f":"IF(BY91<>\"\",(BY91*BZ79),0)","v":0}]
[null,"kg","% errechnet","ca. % ","Klassen","Preis 1","€/kg",null,null,null,null,"kg","% errechnet","ca. % ","Klassen","Preis 1","€/kg",null,null,null,null,"kg","% errechnet","ca. % ","Klassen","Preis 1","€/kg",null,null,null,null,"kg","% errechnet","ca. % ","Klassen","Preis 1","€/kg",null,null,null,null,"kg","% errechnet","ca. % ","Klassen","Preis 1","€/kg",null,null,null,null,"kg","% errechnet","ca. % ","Klassen","Preis 1","€/kg",null,null,null,null,"kg","% errechnet","ca. % ","Klassen","Preis 1","€/kg",null,null,null,null,"kg","% errechnet","ca. % ","Klassen","Preis 1","€/kg"]
[null,null,{"$f":"IF(B81>1,(B81/B$91*100),\"\")","v":""},null,"Klasse 1",null,{"$f":"IF(C81<>\"\",(F81*(C81/100)),F81*(D81/100))","v":0},null,null,null,null,null,{"$f":"IF(L81>1,(L81/L$91*100),\"\")","v":""},null,null,null,{"$f":"IF(M81<>\"\",(P81*(M81/100)),P81*(N81/100))","v":0},null,null,null,null,null,{"$f":"IF(V81>1,(V81/V$91*100),\"\")","v":""},null,null,null,{"$f":"IF(W81<>\"\",(Z81*(W81/100)),Z81*(X81/100))","v":0},null,null,null,null,null,{"$f":"IF(AF81>1,(AF81/AF$91*100),\"\")","v":""},null,null,null,{"$f":"IF(AG81<>\"\",(AJ81*(AG81/100)),AJ81*(AH81/100))","v":0},null,null,null,null,null,{"$f":"IF(AP81>1,(AP81/AP$91*100),\"\")","v":""},null,null,null,{"$f":"IF(AQ81<>\"\",(AT81*(AQ81/100)),AT81*(AR81/100))","v":0},null,null,null,null,null,{"$f":"IF(AZ81>1,(AZ81/AZ$91*100),\"\")","v":""},null,null,null,{"$f":"IF(BA81<>\"\",(BD81*(BA81/100)),BD81*(BB81/100))","v":0},null,null,null,null,null,{"$f":"IF(BJ81>1,(BJ81/BJ$91*100),\"\")","v":""},null,null,null,{"$f":"IF(BK81<>\"\",(BN81*(BK81/100)),BN81*(BL81/100))","v":0},null,null,null,null,null,{"$f":"IF(BT81>1,(BT81/BT$91*100),\"\")","v":""},null,null,null,{"$f":"IF(BU81<>\"\",(BX81*(BU81/100)),BX81*(BV81/100))","v":0}]
[null,null,{"$f":"IF(B82>1,(B82/B$91*100),\"\")","v":""},null,"Klasse 1 vio",null,0,null,null,null,null,null,{"$f":"IF(L82>1,(L82/L$91*100),\"\")","v":""},null,null,null,0,null,null,null,null,null,{"$f":"IF(V82>1,(V82/V$91*100),\"\")","v":""},null,null,null,0,null,null,null,null,null,{"$f":"IF(AF82>1,(AF82/AF$91*100),\"\")","v":""},null,null,null,0,null,null,null,null,null,{"$f":"IF(AP82>1,(AP82/AP$91*100),\"\")","v":""},null,null,null,0,null,null,null,null,null,{"$f":"IF(AZ82>1,(AZ82/AZ$91*100),\"\")","v":""},null,null,null,0,null,null,null,null,null,{"$f":"IF(BJ82>1,(BJ82/BJ$91*100),\"\")","v":""},null,null,null,0,null,null,null,null,null,{"$f":"IF(BT82>1,(BT82/BT$91*100),\"\")","v":""},null,null,null,0]
[null,null,"",null,"Klasse 2",null,0,null,null,null,null,null,"",null,null,null,0,null,null,null,null,null,"",null,null,null,0,null,null,null,null,null,"",null,null,null,0,null,null,null,null,null,"",null,null,null,0,null,null,null,null,null,"",null,null,null,0,null,null,null,null,null,"",null,null,null,0,null,null,null,null,null,"",null,null,null,0]
[null,null,"",null,"Klasse 2 vio",null,0,null,null,null,null,null,"",null,null,null,0,null,null,null,null,null,"",null,null,null,0,null,null,null,null,null,"",null,null,null,0,null,null,null,null,null,"",null,null,null,0,null,null,null,null,null,"",null,null,null,0,null,null,null,null,null,"",null,null,null,0,null,null,null,null,null,"",null,null,null,0]
[null,null,"",null,"Suppe",null,0,null,null,null,null,null,"",null,null,null,0,null,null,null,null,null,"",null,null,null,0,null,null,null,null,null,"",null,null,null,0,null,null,null,null,null,"",null,null,null,0,null,null,null,null,null,"",null,null,null,0,null,null,null,null,null,"",null,null,null,0,null,null,null,null,null,"",null,null,null,0]
[null,null,"",null,"Bruch",null,0,null,null,null,null,null,"",null,null,null,0,null,null,null,null,null,"",null,null,null,0,null,null,null,null,null,"",null,null,null,0,null,null,null,null,null,"",null,null,null,0,null,null,null,null,null,"",null,null,null,0,null,null,null,null,null,"",null,null,null,0,null,null,null,null,null,"",null,null,null,0]
[null,null,"",null,"Spitzen",null,0,null,null,null,null,null,"",null,null,null,0,null,null,null,null,null,"",null,null,null,0,null,null,null,null,null,"",null,null,null,0,null,null,null,null,null,"",null,null,null,0,null,null,null,null,null,"",null,null,null,0,null,null,null,null,null,"",null,null,null,0,null,null,null,null,null,"",null,null,null,0]
[null,null,"",null,null,null,0,null,null,null,null,null,"",null,null,null,0,null,null,null,null,null,"",null,null,null,0,null,null,null,null,null,"",null,null,null,0,null,null,null,null,null,"",null,null,null,0,null,null,null,null,null,"",null,null,null,0,null,null,null,null,null,"",null,null,null,0,null,null,null,null,null,"",null,null,null,0]
[null,null,"",null,null,null,0,null,null,null,null,null,"",null,null,null,0,null,null,null,null,null,"",null,null,null,0,null,null,null,null,null,"",null,null,null,0,null,null,null,null,null,"",null,null,null,0,null,null,null,null,null,"",null,null,null,0,null,null,null,null,null,"",null,null,null,0,null,null,null,null,null,"",null,null,null,0]
[null,null,"",null,null,null,0,null,null,null,null,null,"",null,null,null,0,null,null,null,null,null,"",null,null,null,0,null,null,null,null,null,"",null,null,null,0,null,null,null,null,null,"",null,null,null,0,null,null,null,null,null,"",null,null,null,0,null,null,null,null,null,"",null,null,null,0,null,null,null,null,null,"",null,null,null,0]
[null,{"$f":"SUM(B81:B90)","v":0},null,{"$f":"SUM(D81:D90)","v":0},null,null,{"$f":"IF(SUM(G81:G90)=0,\"\",(SUM(G81:G90)))","v":""},null,null,null,null,{"$f":"SUM(L81:L90)","v":0},null,{"$f":"SUM(N81:N90)","v":0},null,null,{"$f":"IF(SUM(Q81:Q90)=0,\"\",(SUM(Q81:Q90)))","v":""},null,null,null,null,{"$f":"SUM(V81:V90)","v":0},null,{"$f":"SUM(X81:X90)","v":0},null,null,{"$f":"IF(SUM(AA81:AA90)=0,\"\",(SUM(AA81:AA90)))","v":""},null,null,null,null,{"$f":"SUM(AF81:AF90)","v":0},null,{"$f":"SUM(AH81:AH90)","v":0},null,null,{"$f":"IF(SUM(AK81:AK90)=0,\"\",(SUM(AK81:AK90)))","v":""},null,null,null,null,{"$f":"SUM(AP81:AP90)","v":0},null,{"$f":"SUM(AR81:AR90)","v":0},null,null,{"$f":"IF(SUM(AU81:AU90)=0,\"\",(SUM(AU81:AU90)))","v":""},null,null,null,null,{"$f":"SUM(AZ81:AZ90)","v":0},null,{"$f":"SUM(BB81:BB90)","v":0},null,null,{"$f":"IF(SUM(BE81:BE90)=0,\"\",(SUM(BE81:BE90)))","v":""},null,null,null,null,{"$f":"SUM(BJ81:BJ90)","v":0},null,{"$f":"SUM(BL81:BL90)","v":0},null,null,{"$f":"IF(SUM(BO81:BO90)=0,\"\",(SUM(BO81:BO90)))","v":""},null,null,null,null,{"$f":"SUM(BT81:BT90)","v":0},null,{"$f":"SUM(BV81:BV90)","v":0},null,null,{"$f":"IF(SUM(BY81:BY90)=0,\"\",(SUM(BY81:BY90)))","v":""}]
[null,{"$f":"IF(B91<1,\"\",B91/H79)","v":""},null,null,null,null,null,null,null,null,null,{"$f":"IF(L91<1,\"\",L91/R79)","v":""},null,null,null,null,null,null,null,null,null,{"$f":"IF(V91<1,\"\",V91/AB79)","v":""},null,null,null,null,null,null,null,null,null,{"$f":"IF(AF91<1,\"\",AF91/AL79)","v":""},null,null,null,null,null,null,null,null,null,{"$f":"IF(AP91<1,\"\",AP91/AV79)","v":""},null,null,null,null,null,null,null,null,null,{"$f":"IF(AZ91<1,\"\",AZ91/BF79)","v":""},null,null,null,null,null,null,null,null,null,{"$f":"IF(BJ91<1,\"\",BJ91/BP79)","v":""},null,null,null,null,null,null,null,null,null,{"$f":"IF(BT91<1,\"\",BT91/BZ79)","v":""}]

{"sheet":"letztes Blatt","index":13,"n_rows":0,"n_cols":0,"rows_kept":0,"cut":false,"hidden":false,"merged":[]}

{"sheet":"Düngerliste","index":16,"n_rows":50,"n_cols":14,"rows_kept":50,"cut":false,"hidden":false,"merged":[[56,1,56,2],[57,1,57,2],[58,1,58,2],[47,1,47,2],[48,1,48,2],[49,1,49,2],[50,1,50,2],[51,1,51,2],[52,1,52,2],[53,1,53,2],[54,1,54,2],[55,1,55,2],[38,1,38,2],[39,1,39,2],[40,1,40,2],[41,1,41,2],[42,1,42,2],[43,1,43,2],[44,1,44,2],[45,1,45,2],[46,1,46,2],[29,1,29,2],[30,1,30,2],[31,1,31,2],[32,1,32,2],[33,1,33,2],[34,1,34,2],[35,1,35,2],[36,1,36,2],[37,1,37,2],[20,1,20,2],[21,1,21,2],[22,1,22,2],[23,1,23,2],[24,1,24,2],[25,1,25,2],[26,1,26,2],[27,1,27,2],[28,1,28,2],[11,1,11,2],[12,1,12,2],[13,1,13,2],[14,1,14,2],[15,1,15,2],[16,1,16,2],[17,1,17,2],[18,1,18,2],[19,1,19,2],[2,1,2,2],[3,1,3,2],[4,1,4,2],[5,1,5,2],[6,1,6,2],[7,1,7,2],[8,1,8,2],[9,1,9,2],[10,1,10,2],[54,19,54,20],[55,19,55,20],[50,21,50,22],[51,21,51,22],[52,21,52,22],[53,21,53,22],[54,21,54,22],[55,21,55,22],[50,17,50,18],[51,17,51,18],[52,17,52,18],[53,17,53,18],[54,17,54,18],[55,17,55,18],[50,9,50,10],[51,9,51,10],[52,9,52,10],[53,9,53,10],[54,9,54,10],[50,11,50,12],[51,11,51,12],[52,11,52,12],[53,11,53,12],[54,11,54,12],[53,5,53,6],[54,5,54,6],[50,7,50,8],[51,7,51,8],[52,7,52,8],[53,7,53,8],[54,7,54,8],[50,3,50,4],[51,3,51,4],[52,3,52,4],[53,3,53,4],[54,3,54,4],[44,13,44,14],[44,15,44,16],[44,17,44,18],[44,19,44,20],[44,21,44,22],[55,3,55,4],[55,5,55,6],[55,7,55,8],[55,9,55,10],[44,3,44,4],[44,5,44,6],[44,7,44,8],[44,9,44,10],[44,11,44,12],[48,3,48,4],[48,5,48,6],[48,7,48,8],[46,15,46,16],[46,17,46,18],[45,13,45,14],[45,15,45,16],[49,3,49,4],[49,5,49,6],[49,7,49,8],[43,15,43,16],[43,17,43,18],[43,19,43,20],[43,21,43,22],[42,13,42,14],[42,15,42,16],[42,17,42,18],[42,19,42,20],[42,21,42,22],[43,3,43,4],[43,5,43,6],[43,7,43,8],[43,9,43,10],[42,3,42,4],[42,5,42,6],[42,7,42,8],[42,9,42,10],[41,13,41,14],[41,3,41,4],[41,5,41,6],[41,7,41,8],[41,9,41,10],[43,13,43,14],[41,15,41,16],[41,17,41,18],[41,19,41,20],[41,21,41,22],[40,13,40,14],[40,15,40,16],[40,17,40,18],[40,19,40,20],[40,21,40,22],[40,3,40,4],[40,5,40,6],[40,7,40,8],[40,9,40,10],[36,21,36,22],[36,11,36,12],[39,3,39,4],[39,5,39,6],[39,7,39,8],[39,9,39,10],[38,3,38,4],[38,5,38,6],[38,7,38,8],[38,9,38,10],[39,11,39,12],[39,13,39,14],[39,15,39,16],[39,17,39,18],[39,19,39,20],[39,21,39,22],[38,13,38,14],[38,15,38,16],[38,17,38,18],[38,19,38,20],[38,21,38,22],[38,11,38,12],[34,17,34,18],[34,19,34,20],[34,21,34,22],[34,11,34,12],[37,3,37,4],[37,5,37,6],[37,7,37,8],[37,9,37,10],[36,3,36,4],[36,5,36,6],[36,7,36,8],[36,9,36,10],[37,11,37,12],[37,13,37,14],[37,15,37,16],[37,17,37,18],[37,19,37,20],[37,21,37,22],[36,13,36,14],[36,15,36,16],[36,17,36,18],[36,19,36,20],[33,19,33,20],[33,21,33,22],[32,13,32,14],[32,15,32,16],[32,17,32,18],[32,19,32,20],[32,21,32,22],[32,11,32,12],[35,3,35,4],[35,5,35,6],[35,7,35,8],[35,9,35,10],[34,3,34,4],[34,5,34,6],[34,7,34,8],[34,9,34,10],[35,11,35,12],[35,13,35,14],[35,15,35,16],[35,17,35,18],[35,19,35,20],[35,21,35,22],[33,3,33,4],[33,5,33,6],[33,7,33,8],[33,9,33,10],[32,3,32,4],[32,5,32,6],[32,7,32,8],[32,9,32,10],[28,19,28,20],[28,21,28,22],[28,11,28,12],[31,3,31,4],[31,5,31,6],[31,7,31,8],[31,9,31,10],[30,3,30,4],[30,5,30,6],[30,7,30,8],[30,9,30,10],[31,11,31,12],[31,13,31,14],[31,15,31,16],[31,17,31,18],[31,19,31,20],[31,21,31,22],[30,13,30,14],[30,17,30,18],[30,19,30,20],[30,21,30,22],[27,19,27,20],[27,21,27,22],[26,13,26,14],[26,15,26,16],[26,17,26,18],[26,19,26,20],[26,21,26,22],[29,13,29,14],[29,15,29,16],[29,17,29,18],[29,19,29,20],[29,21,29,22],[27,3,27,4],[27,5,27,6],[27,7,27,8],[27,9,27,10],[26,3,26,4],[26,5,26,6],[26,7,26,8],[26,9,26,10],[30,15,30,16],[29,3,29,4],[29,5,29,6],[29,7,29,8],[29,9,29,10],[28,3,28,4],[28,5,28,6],[28,7,28,8],[28,9,28,10],[29,11,29,12],[25,13,25,14],[25,15,25,16],[25,17,25,18],[25,19,25,20],[25,21,25,22],[24,13,24,14],[24,15,24,16],[24,17,24,18],[24,19,24,20],[24,21,24,22],[25,3,25,4],[25,5,25,6],[25,7,25,8],[25,9,25,10],[24,3,24,4],[24,5,24,6],[24,7,24,8],[24,9,24,10],[25,11,25,12],[24,11,24,12],[23,7,23,8],[23,9,23,10],[21,15,21,16],[21,17,21,18],[21,19,21,20],[21,21,21,22],[22,3,22,4],[22,5,22,6],[22,7,22,8],[22,9,22,10],[22,11,22,12],[23,11,23,12],[23,13,23,14],[23,15,23,16],[23,17,23,18],[23,19,23,20],[23,21,23,22],[22,13,22,14],[22,15,22,16],[22,17,22,18],[22,19,22,20],[22,21,22,22],[23,3,23,4],[23,5,23,6],[18,3,18,4],[18,5,18,6],[18,7,18,8],[18,9,18,10],[18,11,18,12],[20,19,20,20],[20,21,20,22],[21,3,21,4],[21,5,21,6],[21,7,21,8],[21,9,21,10],[21,11,21,12],[21,13,21,14],[20,3,20,4],[20,5,20,6],[20,7,20,8],[20,9,20,10],[20,11,20,12],[20,13,20,14],[20,15,20,16],[20,17,20,18],[58,11,58,12],[10,11,10,12],[11,11,11,12],[56,11,56,12],[57,11,57,12],[12,11,12,12],[13,11,13,12],[17,11,17,12],[16,11,16,12],[14,11,14,12],[48,11,48,12],[27,11,27,12],[30,11,30,12],[33,11,33,12],[41,11,41,12],[40,11,40,12],[43,11,43,12],[42,11,42,12],[55,11,55,12],[49,11,49,12],[19,11,19,12],[26,11,26,12],[2,11,2,12],[3,11,3,12],[4,11,4,12],[5,11,5,12],[6,11,6,12],[7,11,7,12],[8,11,8,12],[9,11,9,12],[7,5,7,6],[7,7,7,8],[7,9,7,10],[4,5,4,6],[4,7,4,8],[4,9,4,10],[5,5,5,6],[5,7,5,8],[57,3,57,4],[58,5,58,6],[58,7,58,8],[58,9,58,10],[10,5,10,6],[10,7,10,8],[10,9,10,10],[12,3,12,4],[13,3,13,4],[12,9,12,10],[13,5,13,6],[13,7,13,8],[11,5,11,6],[12,7,12,8],[56,5,56,6],[56,7,56,8],[46,5,46,6],[16,5,16,6],[17,9,17,10],[13,9,13,10],[50,5,50,6],[51,5,51,6],[52,5,52,6],[49,9,49,10],[2,3,2,4],[3,3,3,4],[6,7,6,8],[6,9,6,10],[7,3,7,4],[58,3,58,4],[12,5,12,6],[56,9,56,10],[57,5,57,6],[57,7,57,8],[57,9,57,10],[14,7,14,8],[16,9,16,10],[14,9,14,10],[16,3,16,4],[46,3,46,4],[56,3,56,4],[8,3,8,4],[2,5,2,6],[2,9,2,10],[2,7,2,8],[3,5,3,6],[3,7,3,8],[3,9,3,10],[4,3,4,4],[5,3,5,4],[6,3,6,4],[9,3,9,4],[10,3,10,4],[11,3,11,4],[5,9,5,10],[6,5,6,6],[7,13,7,14],[6,13,6,14],[11,7,11,8],[11,9,11,10],[8,5,8,6],[8,7,8,8],[8,9,8,10],[9,5,9,6],[9,7,9,8],[9,9,9,10],[7,15,7,16],[7,17,7,18],[8,13,8,14],[8,15,8,16],[8,17,8,18],[15,3,15,4],[47,9,47,10],[47,11,47,12],[45,5,45,6],[45,7,45,8],[45,9,45,10],[45,11,45,12],[46,9,46,10],[46,11,46,12],[46,7,46,8],[17,7,17,8],[16,7,16,8],[15,9,15,10],[15,11,15,12],[15,5,15,6],[15,7,15,8],[17,5,17,6],[11,17,11,18],[12,13,12,14],[12,15,12,16],[12,17,12,18],[13,13,13,14],[13,15,13,16],[46,13,46,14],[9,13,9,14],[9,15,9,16],[9,17,9,18],[10,13,10,14],[10,15,10,16],[10,17,10,18],[27,13,27,14],[27,15,27,16],[27,17,27,18],[28,13,28,14],[28,15,28,16],[28,17,28,18],[33,13,33,14],[33,15,33,16],[33,17,33,18],[34,13,34,14],[34,15,34,16],[13,17,13,18],[16,15,16,16],[16,17,16,18],[47,3,47,4],[47,5,47,6],[47,7,47,8],[17,3,17,4],[45,3,45,4],[14,3,14,4],[14,5,14,6],[48,9,48,10],[19,3,19,4],[19,5,19,6],[15,13,15,14],[15,15,15,16],[15,17,15,18],[16,13,16,14],[17,13,17,14],[17,15,17,16],[17,17,17,18],[14,15,14,16],[14,17,14,18],[19,7,19,8],[19,9,19,10],[19,13,19,14],[19,15,19,16],[2,13,2,14],[2,15,2,16],[2,17,2,18],[4,13,4,14],[4,15,4,16],[4,17,4,18],[5,13,5,14],[5,15,5,16],[5,17,5,18],[3,13,3,14],[3,15,3,16],[3,17,3,18],[6,15,6,16],[6,17,6,18],[11,13,11,14],[11,15,11,16],[58,13,58,14],[58,15,58,16],[58,17,58,18],[47,13,47,14],[47,15,47,16],[47,17,47,18],[48,13,48,14],[48,15,48,16],[48,17,48,18],[49,13,49,14],[50,15,50,16],[51,15,51,16],[52,15,52,16],[53,15,53,16],[54,15,54,16],[55,15,55,16],[50,13,50,14],[51,13,51,14],[52,13,52,14],[53,13,53,14],[54,13,54,14],[55,13,55,14],[6,19,6,20],[6,21,6,22],[56,13,56,14],[56,15,56,16],[56,17,56,18],[57,13,57,14],[57,15,57,16],[57,17,57,18],[49,15,49,16],[49,17,49,18],[11,19,11,20],[11,21,11,22],[48,19,48,20],[48,21,48,22],[15,19,15,20],[15,21,15,22],[45,17,45,18],[18,13,18,14],[18,15,18,16],[18,17,18,18],[19,17,19,18],[14,13,14,14],[2,19,2,20],[2,21,2,22],[3,19,3,20],[3,21,3,22],[4,19,4,20],[4,21,4,22],[5,19,5,20],[5,21,5,22],[16,19,16,20],[16,21,16,22],[7,19,7,20],[7,21,7,22],[8,19,8,20],[8,21,8,22],[9,19,9,20],[9,21,9,22],[10,19,10,20],[10,21,10,22],[12,19,12,20],[12,21,12,22],[13,19,13,20],[13,21,13,22],[14,19,14,20],[14,21,14,22],[58,19,58,20],[58,21,58,22],[17,19,17,20],[17,21,17,22],[45,19,45,20],[45,21,45,22],[46,19,46,20],[46,21,46,22],[47,19,47,20],[47,21,47,22],[49,19,49,20],[49,21,49,22],[56,19,56,20],[56,21,56,22],[57,19,57,20],[57,21,57,22],[50,19,50,20],[51,19,51,20],[52,19,52,20],[53,19,53,20],[18,19,18,20],[18,21,18,22],[19,19,19,20],[19,21,19,22]]}
[]
[]
[null,"Dünger",null,"Preis",null,"N",null,"P2O5",null,"K2O",null,"gekauft bei",null,"MgO"]
[null,"Harnstoff",null,15.5,null,46]
[null,"KAS",null,28.5,null,27]
[null,"ASS",null,22,null,26]
[null,"Entec",null,36,null,14,null,7,null,17]
[null,"DAP",null,52.5,null,18,null,46]
[null,"40 er Kali",null,28.25,null,null,null,null,null,40]
[null,"Kainit",null,9.9,null,null,null,null,null,10]
[null,"Kieserit",null,30.95,null,null,null,null,null,30]
[null,"DAP-KAS",null,40.5,null,22.5,null,23]
[null,"Ahl",null,26.5]
[null,"Kohlens. Kalk",null,7.5]
[null,"Entec-Misch",null,45.2,null,"12,8N",null,5.0999999999999996,null,14.1]
[]
[]
[]
[]
[]
[]
[]
[]
[]
[]
[]
[]
[]
[]
[]
[]
[]
[]
[]
[]
[]
[]
[]
[]
[]
[]
[]
[]
[]
[]
[]
[]
[]
[null,"Gülle",null,null,null,2.4,null,3.1,null,3.2]
[null,"Gärrest",null,8,null,5,null,1.59,null,5.26]

{"sheet":"PSMListe","index":17,"n_rows":312,"n_cols":9,"rows_kept":312,"cut":false,"hidden":false,"merged":[]}
[]
[null,"Pflanzenschutzmittelliste"]
[]
[null,"Mittel","Preis","Wirkstoff","Wartezeit","gekauft bei","sonstiges","sonstiges","sonstiges"]
[null,"Amistar Opti",18.600000000000001,"Azoxstrobin/Chlortalonil","F"]
[null,"Artist",25.8,"Metribuzin/Flufenacet","F"]
[null,"Buctril",11.5,"Bromoxynil","F"]
[null,"Discus",115.8,"Kresoxim-methyl","F"]
[null,"Flint",167,"Trifloxystrobin","F"]
[null,"Fortress 250",59.8,"Quinoxyfen","F"]
[null,"Fusilade Max",24.3,"Fluazifop-P","F"]
[null,"Karate Zeon",137.30000000000001,"Lambda-Cyhalothrin","3 Tage"]
[null,"Kerb Flo",37.1,"Propyzamid","F"]
[null,"Lentagran WP",35.549999999999997,"Pyridat","F"]
[]
[null,"Ortiva",47.8,"Azoxystrobin","F"]
[null,"Perfekthion",12.1,"Dimethoat","F"]
[null,"Polyram WG",6.2,"Metiram","F"]
[null,"Roundup Ultram.",8.5,"Glyphosat","F"]
[null,"Rovral WG",60.9,"Iprodion","F"]
[null,"Score",70.3,"Difenoconazol","F"]
[null,"Cuprozin progress",29.8,"Kupferhydroxid","F"]
[null,"Signum",53.8,"Pyraclostrobin / Boscalid","F"]
[null,"Switch",108.1,"Fludioxonil / Cyprodinil","7 T"]
[]
[]
[null,"Stomp Aqua",13,"Pendimethalin","F"]
[null,"Sencor liquid",26.8,"Metribucin","7T"]
[null,null,null,null,"F"]
[null,"Cartana","149,40 a Stü.",null,"F"]
[null,"Forox F","387,60 a Stü.","Flumicxazin","F"]
[null,"Ultra Max",18.100000000000001,"Glyphosat","F"]
[null,"Champion",36.700000000000003,"Boscalid u. Epoconazol","F"]
[null,"Calipso",124.5,"Thiacloprid","F"]
[null,"Mais Banvel","47,-€","Dicamba","F"]
[null,"Bacara",39.1,"1,0l/ ha","F"]
[null,"Clio-Zegran",20.5,null,"F"]
[null,"Spectrum",20.95,"Dimethenamid-P","F"]
[null,"Cock Herbi. n.Sais",69.569999999999993,"1,5Lent+0,25Sencor+0,3CertrB","F"]
[null,"Cock Fungi n.Sais",139.75,"0,8Switch+ 0,7 Rowral","F"]
[null,"Centium",148.5,"Clomazone","F"]
[null,"Buctril",11.5,"Bromoxinil","F"]
[]
[]
[]
[]
[]
[]
[]
[]
[]
[]
[]
[]
[]
[]
[]
[]
[]
[]
[]
[]
[]
[]
[]
[]
[]
[]
[]
[]
[]
[]
[]
[]
[]
[]
[]
[]
[]
[]
[]
[]
[]
[]
[]
[]
[]
[]
[]
[]
[]
[]
[]
[]
[]
[]
[]
[]
[]
[]
[]
[]
[]
[]
[null,"Ab hier beginnen die Mittelmischungen","€/Mischung","Wirkstoff 1","Wirkstoff 2","Wirkstoff 3","Wirkstoff 4","Wirkstoff 5","Wirkstoff 6"]
[null,{"$f":"IF(B154=\"\",\"\",B154)","v":"Rovral 0,7 + Polyram 1,0"},{"$f":"C154","v":48.83},{"$f":"IF(D154=\"\",\"\",VLOOKUP(D154,Wirkstoffe,3,FALSE))","v":"Iprodion"},"Metiram","","","",""]
[null,{"$f":"IF(B158=\"\",\"\",B158)","v":"Stomp Aqua 3,5 + Sencor liquid 0,4"},{"$f":"C158","v":56.22},{"$f":"IF(D158=\"\",\"\",VLOOKUP(D158,Wirkstoffe,3,FALSE))","v":"Pendimethalin"},"Metribucin","","","",""]
[null,{"$f":"IF(B162=\"\",\"\",B162)","v":"A.Opti 2,0 + Cu Pro 2,0"},{"$f":"C162","v":96.800000000000011},{"$f":"IF(D162=\"\",\"\",VLOOKUP(D162,Wirkstoffe,3,FALSE))","v":"Azoxstrobin/Chlortalonil"},"Kupferhydroxid","","","",""]
[null,{"$f":"IF(B166=\"\",\"\",B166)","v":"Buctril 0,5 + Sencor liquid 0,5"},{"$f":"C166","v":19.149999999999999},{"$f":"IF(D166=\"\",\"\",VLOOKUP(D166,Wirkstoffe,3,FALSE))","v":"Bromoxynil"},"Metribucin","","","",""]
[null,{"$f":"IF(B170=\"\",\"\",B170)","v":""},{"$f":"C170","v":""},{"$f":"IF(D170=\"\",\"\",VLOOKUP(D170,Wirkstoffe,3,FALSE))","v":""},"","","","",""]
[null,{"$f":"IF(B174=\"\",\"\",B174)","v":""},{"$f":"C174","v":""},{"$f":"IF(D174=\"\",\"\",VLOOKUP(D174,Wirkstoffe,3,FALSE))","v":""},"","","","",""]
[null,{"$f":"IF(B178=\"\",\"\",B178)","v":""},{"$f":"C178","v":""},{"$f":"IF(D178=\"\",\"\",VLOOKUP(D178,Wirkstoffe,3,FALSE))","v":""},"","","","",""]
[null,{"$f":"IF(B182=\"\",\"\",B182)","v":""},{"$f":"C182","v":""},{"$f":"IF(D182=\"\",\"\",VLOOKUP(D182,Wirkstoffe,3,FALSE))","v":""},"","","","",""]
[null,{"$f":"IF(B186=\"\",\"\",B186)","v":""},{"$f":"C186","v":""},{"$f":"IF(D186=\"\",\"\",VLOOKUP(D186,Wirkstoffe,3,FALSE))","v":""},"","","","",""]
[null,{"$f":"IF(B190=\"\",\"\",B190)","v":""},{"$f":"C190","v":""},{"$f":"IF(D190=\"\",\"\",VLOOKUP(D190,Wirkstoffe,3,FALSE))","v":""},"","","","",""]
[null,{"$f":"IF(B194=\"\",\"\",B194)","v":""},{"$f":"C194","v":""},{"$f":"IF(D194=\"\",\"\",VLOOKUP(D194,Wirkstoffe,3,FALSE))","v":""},"","","","",""]
[null,{"$f":"IF(B198=\"\",\"\",B198)","v":""},{"$f":"C198","v":""},{"$f":"IF(D198=\"\",\"\",VLOOKUP(D198,Wirkstoffe,3,FALSE))","v":""},"","","","",""]
[null,{"$f":"IF(B202=\"\",\"\",B202)","v":""},{"$f":"C202","v":""},{"$f":"IF(D202=\"\",\"\",VLOOKUP(D202,Wirkstoffe,3,FALSE))","v":""},"","","","",""]
[null,{"$f":"IF(B206=\"\",\"\",B206)","v":""},{"$f":"C206","v":""},{"$f":"IF(D206=\"\",\"\",VLOOKUP(D206,Wirkstoffe,3,FALSE))","v":""},"","","","",""]
[null,{"$f":"IF(B210=\"\",\"\",B210)","v":""},{"$f":"C210","v":""},{"$f":"IF(D210=\"\",\"\",VLOOKUP(D210,Wirkstoffe,3,FALSE))","v":""},"","","","",""]
[null,{"$f":"IF(B214=\"\",\"\",B214)","v":""},{"$f":"C214","v":""},{"$f":"IF(D214=\"\",\"\",VLOOKUP(D214,Wirkstoffe,3,FALSE))","v":""},"","","","",""]
[null,{"$f":"IF(B218=\"\",\"\",B218)","v":""},{"$f":"C218","v":""},{"$f":"IF(D218=\"\",\"\",VLOOKUP(D218,Wirkstoffe,3,FALSE))","v":""},"","","","",""]
[null,{"$f":"IF(B222=\"\",\"\",B222)","v":""},{"$f":"C222","v":""},{"$f":"IF(D222=\"\",\"\",VLOOKUP(D222,Wirkstoffe,3,FALSE))","v":""},"","","","",""]
[null,{"$f":"IF(B226=\"\",\"\",B226)","v":""},{"$f":"C226","v":""},{"$f":"IF(D226=\"\",\"\",VLOOKUP(D226,Wirkstoffe,3,FALSE))","v":""},"","","","",""]
[null,{"$f":"IF(B230=\"\",\"\",B230)","v":""},{"$f":"C230","v":""},{"$f":"IF(D230=\"\",\"\",VLOOKUP(D230,Wirkstoffe,3,FALSE))","v":""},"","","","",""]
[null,{"$f":"IF(B234=\"\",\"\",B234)","v":""},{"$f":"C234","v":""},{"$f":"IF(D234=\"\",\"\",VLOOKUP(D234,Wirkstoffe,3,FALSE))","v":""},"","","","",""]
[null,{"$f":"IF(B238=\"\",\"\",B238)","v":""},{"$f":"C238","v":""},{"$f":"IF(D238=\"\",\"\",VLOOKUP(D238,Wirkstoffe,3,FALSE))","v":""},"","","","",""]
[null,{"$f":"IF(B242=\"\",\"\",B242)","v":""},{"$f":"C242","v":""},{"$f":"IF(D242=\"\",\"\",VLOOKUP(D242,Wirkstoffe,3,FALSE))","v":""},"","","","",""]
[null,{"$f":"IF(B246=\"\",\"\",B246)","v":""},{"$f":"C246","v":""},{"$f":"IF(D246=\"\",\"\",VLOOKUP(D246,Wirkstoffe,3,FALSE))","v":""},"","","","",""]
[null,{"$f":"IF(B250=\"\",\"\",B250)","v":""},{"$f":"C250","v":""},{"$f":"IF(D250=\"\",\"\",VLOOKUP(D250,Wirkstoffe,3,FALSE))","v":""},"","","","",""]
[null,{"$f":"IF(B254=\"\",\"\",B254)","v":""},{"$f":"C254","v":""},{"$f":"IF(D254=\"\",\"\",VLOOKUP(D254,Wirkstoffe,3,FALSE))","v":""},"","","","",""]
[null,{"$f":"IF(B258=\"\",\"\",B258)","v":""},{"$f":"C258","v":""},{"$f":"IF(D258=\"\",\"\",VLOOKUP(D258,Wirkstoffe,3,FALSE))","v":""},"","","","",""]
[null,{"$f":"IF(B262=\"\",\"\",B262)","v":""},{"$f":"C262","v":""},{"$f":"IF(D262=\"\",\"\",VLOOKUP(D262,Wirkstoffe,3,FALSE))","v":""},"","","","",""]
[null,{"$f":"IF(B266=\"\",\"\",B266)","v":""},{"$f":"C266","v":""},{"$f":"IF(D266=\"\",\"\",VLOOKUP(D266,Wirkstoffe,3,FALSE))","v":""},"","","","",""]
[null,{"$f":"IF(B270=\"\",\"\",B270)","v":""},{"$f":"C270","v":""},{"$f":"IF(D270=\"\",\"\",VLOOKUP(D270,Wirkstoffe,3,FALSE))","v":""},"","","","",""]
[null,{"$f":"IF(B274=\"\",\"\",B274)","v":""},{"$f":"C274","v":""},{"$f":"IF(D274=\"\",\"\",VLOOKUP(D274,Wirkstoffe,3,FALSE))","v":""},"","","","",""]
[null,{"$f":"IF(B278=\"\",\"\",B278)","v":""},{"$f":"C278","v":""},{"$f":"IF(D278=\"\",\"\",VLOOKUP(D278,Wirkstoffe,3,FALSE))","v":""},"","","","",""]
[null,{"$f":"IF(B282=\"\",\"\",B282)","v":""},{"$f":"C282","v":""},{"$f":"IF(D282=\"\",\"\",VLOOKUP(D282,Wirkstoffe,3,FALSE))","v":""},"","","","",""]
[null,{"$f":"IF(B286=\"\",\"\",B286)","v":""},{"$f":"C286","v":""},{"$f":"IF(D286=\"\",\"\",VLOOKUP(D286,Wirkstoffe,3,FALSE))","v":""},"","","","",""]
[null,{"$f":"IF(B290=\"\",\"\",B290)","v":""},{"$f":"C290","v":""},{"$f":"IF(D290=\"\",\"\",VLOOKUP(D290,Wirkstoffe,3,FALSE))","v":""},"","","","",""]
[null,{"$f":"IF(B294=\"\",\"\",B294)","v":""},{"$f":"C294","v":""},{"$f":"IF(D294=\"\",\"\",VLOOKUP(D294,Wirkstoffe,3,FALSE))","v":""},"","","","",""]
[null,{"$f":"IF(B298=\"\",\"\",B298)","v":""},{"$f":"C298","v":""},{"$f":"IF(D298=\"\",\"\",VLOOKUP(D298,Wirkstoffe,3,FALSE))","v":""},"","","","",""]
[null,{"$f":"IF(B302=\"\",\"\",B302)","v":""},{"$f":"C302","v":""},{"$f":"IF(D302=\"\",\"\",VLOOKUP(D302,Wirkstoffe,3,FALSE))","v":""},"","","","",""]
[null,{"$f":"IF(B306=\"\",\"\",B306)","v":""},{"$f":"C306","v":""},{"$f":"IF(D306=\"\",\"\",VLOOKUP(D306,Wirkstoffe,3,FALSE))","v":""},"","","","",""]
[null,{"$f":"IF(B310=\"\",\"\",B310)","v":""},{"$f":"C310","v":""},{"$f":"IF(D310=\"\",\"\",VLOOKUP(D310,Wirkstoffe,3,FALSE))","v":""},"","","","",""]
[]
[]
[]
[]
[]
[]
[null,"Berechnung von Mittelmischungen"]
[null,null,null,"Mittel 1","Mittel 2","Mittel 3","Mittel 4","Mittel 5","Mittel 6"]
[null,"Rovral 0,7 + Polyram 1,0",{"$f":"IF(D154=\"\",\"\",D155*D156+E155*E156+F155*F156+G155*G156+H155*H156+I155*I156)","v":48.83},"Rovral WG","Polyram WG"]
[null,"Preis/Einheit",null,{"$f":"IF(D154=\"\",0,(VLOOKUP(D154,$B$5:$C$104,2,FALSE)))","v":60.9},6.2,0,0,0,0]
[null,"Aufwandmenge",null,0.7,1]
[]
[null,"Stomp Aqua 3,5 + Sencor liquid 0,4",{"$f":"IF(D158=\"\",\"\",D159*D160+E159*E160+F159*F160+G159*G160+H159*H160+I159*I160)","v":56.22},"Stomp Aqua","Sencor liquid"]
[null,"Preis/Einheit",null,{"$f":"IF(D158=\"\",0,(VLOOKUP(D158,$B$5:$C$104,2,FALSE)))","v":13},26.8,0,0,0,0]
[null,"Aufwandmenge",null,3.5,0.4,0.4]
[]
[null,"A.Opti 2,0 + Cu Pro 2,0",{"$f":"IF(D162=\"\",\"\",D163*D164+E163*E164+F163*F164+G163*G164+H163*H164+I163*I164)","v":96.800000000000011},"Amistar Opti","Cuprozin progress"]
[null,"Preis/Einheit",null,{"$f":"IF(D162=\"\",0,(VLOOKUP(D162,$B$5:$C$104,2,FALSE)))","v":18.600000000000001},29.8,0,0,0,0]
[null,"Aufwandmenge",null,2,2]
[]
[null,"Buctril 0,5 + Sencor liquid 0,5",{"$f":"IF(D166=\"\",\"\",D167*D168+E167*E168+F167*F168+G167*G168+H167*H168+I167*I168)","v":19.149999999999999},"Buctril","Sencor liquid"]
[null,"Preis/Einheit",null,{"$f":"IF(D166=\"\",0,(VLOOKUP(D166,$B$5:$C$104,2,FALSE)))","v":11.5},26.8,0,0,0,0]
[null,"Aufwandmenge",null,0.5,0.5]
[]
[null,null,{"$f":"IF(D170=\"\",\"\",D171*D172+E171*E172+F171*F172+G171*G172+H171*H172+I171*I172)","v":""}]
[null,"Preis/Einheit",null,{"$f":"IF(D170=\"\",0,(VLOOKUP(D170,$B$5:$C$104,2,FALSE)))","v":0},0,0,0,0,0]
[null,"Aufwandmenge"]
[]
[null,null,{"$f":"IF(D174=\"\",\"\",D175*D176+E175*E176+F175*F176+G175*G176+H175*H176+I175*I176)","v":""}]
[null,"Preis/Einheit",null,{"$f":"IF(D174=\"\",0,(VLOOKUP(D174,$B$5:$C$104,2,FALSE)))","v":0},0,0,0,0,0]
[null,"Aufwandmenge"]
[]
[null,null,{"$f":"IF(D178=\"\",\"\",D179*D180+E179*E180+F179*F180+G179*G180+H179*H180+I179*I180)","v":""}]
[null,"Preis/Einheit",null,{"$f":"IF(D178=\"\",0,(VLOOKUP(D178,$B$5:$C$104,2,FALSE)))","v":0},0,0,0,0,0]
[null,"Aufwandmenge"]
[]
[null,null,{"$f":"IF(D182=\"\",\"\",D183*D184+E183*E184+F183*F184+G183*G184+H183*H184+I183*I184)","v":""}]
[null,"Preis/Einheit",null,{"$f":"IF(D182=\"\",0,(VLOOKUP(D182,$B$5:$C$104,2,FALSE)))","v":0},0,0,0,0,0]
[null,"Aufwandmenge"]
[]
[null,null,{"$f":"IF(D186=\"\",\"\",D187*D188+E187*E188+F187*F188+G187*G188+H187*H188+I187*I188)","v":""}]
[null,"Preis/Einheit",null,{"$f":"IF(D186=\"\",0,(VLOOKUP(D186,$B$5:$C$104,2,FALSE)))","v":0},0,0,0,0,0]
[null,"Aufwandmenge"]
[]
[null,null,{"$f":"IF(D190=\"\",\"\",D191*D192+E191*E192+F191*F192+G191*G192+H191*H192+I191*I192)","v":""}]
[null,"Preis/Einheit",null,{"$f":"IF(D190=\"\",0,(VLOOKUP(D190,$B$5:$C$104,2,FALSE)))","v":0},0,0,0,0,0]
[null,"Aufwandmenge"]
[]
[null,null,{"$f":"IF(D194=\"\",\"\",D195*D196+E195*E196+F195*F196+G195*G196+H195*H196+I195*I196)","v":""}]
[null,"Preis/Einheit",null,{"$f":"IF(D194=\"\",0,(VLOOKUP(D194,$B$5:$C$104,2,FALSE)))","v":0},0,0,0,0,0]
[null,"Aufwandmenge"]
[]
[null,null,{"$f":"IF(D198=\"\",\"\",D199*D200+E199*E200+F199*F200+G199*G200+H199*H200+I199*I200)","v":""}]
[null,"Preis/Einheit",null,{"$f":"IF(D198=\"\",0,(VLOOKUP(D198,$B$5:$C$104,2,FALSE)))","v":0},0,0,0,0,0]
[null,"Aufwandmenge"]
[]
[null,null,{"$f":"IF(D202=\"\",\"\",D203*D204+E203*E204+F203*F204+G203*G204+H203*H204+I203*I204)","v":""}]
[null,"Preis/Einheit",null,{"$f":"IF(D202=\"\",0,(VLOOKUP(D202,$B$5:$C$104,2,FALSE)))","v":0},0,0,0,0,0]
[null,"Aufwandmenge"]
[]
[null,null,{"$f":"IF(D206=\"\",\"\",D207*D208+E207*E208+F207*F208+G207*G208+H207*H208+I207*I208)","v":""}]
[null,"Preis/Einheit",null,{"$f":"IF(D206=\"\",0,(VLOOKUP(D206,$B$5:$C$104,2,FALSE)))","v":0},0,0,0,0,0]
[null,"Aufwandmenge"]
[]
[null,null,{"$f":"IF(D210=\"\",\"\",D211*D212+E211*E212+F211*F212+G211*G212+H211*H212+I211*I212)","v":""}]
[null,"Preis/Einheit",null,{"$f":"IF(D210=\"\",0,(VLOOKUP(D210,$B$5:$C$104,2,FALSE)))","v":0},0,0,0,0,0]
[null,"Aufwandmenge"]
[]
[null,null,{"$f":"IF(D214=\"\",\"\",D215*D216+E215*E216+F215*F216+G215*G216+H215*H216+I215*I216)","v":""}]
[null,"Preis/Einheit",null,{"$f":"IF(D214=\"\",0,(VLOOKUP(D214,$B$5:$C$104,2,FALSE)))","v":0},0,0,0,0,0]
[null,"Aufwandmenge"]
[]
[null,null,{"$f":"IF(D218=\"\",\"\",D219*D220+E219*E220+F219*F220+G219*G220+H219*H220+I219*I220)","v":""}]
[null,"Preis/Einheit",null,{"$f":"IF(D218=\"\",0,(VLOOKUP(D218,$B$5:$C$104,2,FALSE)))","v":0},0,0,0,0,0]
[null,"Aufwandmenge"]
[]
[null,null,{"$f":"IF(D222=\"\",\"\",D223*D224+E223*E224+F223*F224+G223*G224+H223*H224+I223*I224)","v":""}]
[null,"Preis/Einheit",null,{"$f":"IF(D222=\"\",0,(VLOOKUP(D222,$B$5:$C$104,2,FALSE)))","v":0},0,0,0,0,0]
[null,"Aufwandmenge"]
[]
[null,null,{"$f":"IF(D226=\"\",\"\",D227*D228+E227*E228+F227*F228+G227*G228+H227*H228+I227*I228)","v":""}]
[null,"Preis/Einheit",null,{"$f":"IF(D226=\"\",0,(VLOOKUP(D226,$B$5:$C$104,2,FALSE)))","v":0},0,0,0,0,0]
[null,"Aufwandmenge"]
[]
[null,null,{"$f":"IF(D230=\"\",\"\",D231*D232+E231*E232+F231*F232+G231*G232+H231*H232+I231*I232)","v":""}]
[null,"Preis/Einheit",null,{"$f":"IF(D230=\"\",0,(VLOOKUP(D230,$B$5:$C$104,2,FALSE)))","v":0},0,0,0,0,0]
[null,"Aufwandmenge"]
[]
[null,null,{"$f":"IF(D234=\"\",\"\",D235*D236+E235*E236+F235*F236+G235*G236+H235*H236+I235*I236)","v":""}]
[null,"Preis/Einheit",null,{"$f":"IF(D234=\"\",0,(VLOOKUP(D234,$B$5:$C$104,2,FALSE)))","v":0},0,0,0,0,0]
[null,"Aufwandmenge"]
[]
[null,null,{"$f":"IF(D238=\"\",\"\",D239*D240+E239*E240+F239*F240+G239*G240+H239*H240+I239*I240)","v":""}]
[null,"Preis/Einheit",null,{"$f":"IF(D238=\"\",0,(VLOOKUP(D238,$B$5:$C$104,2,FALSE)))","v":0},0,0,0,0,0]
[null,"Aufwandmenge"]
[]
[null,null,{"$f":"IF(D242=\"\",\"\",D243*D244+E243*E244+F243*F244+G243*G244+H243*H244+I243*I244)","v":""}]
[null,"Preis/Einheit",null,{"$f":"IF(D242=\"\",0,(VLOOKUP(D242,$B$5:$C$104,2,FALSE)))","v":0},0,0,0,0,0]
[null,"Aufwandmenge"]
[]
[null,null,{"$f":"IF(D246=\"\",\"\",D247*D248+E247*E248+F247*F248+G247*G248+H247*H248+I247*I248)","v":""}]
[null,"Preis/Einheit",null,{"$f":"IF(D246=\"\",0,(VLOOKUP(D246,$B$5:$C$104,2,FALSE)))","v":0},0,0,0,0,0]
[null,"Aufwandmenge"]
[]
[null,null,{"$f":"IF(D250=\"\",\"\",D251*D252+E251*E252+F251*F252+G251*G252+H251*H252+I251*I252)","v":""}]
[null,"Preis/Einheit",null,{"$f":"IF(D250=\"\",0,(VLOOKUP(D250,$B$5:$C$104,2,FALSE)))","v":0},0,0,0,0,0]
[null,"Aufwandmenge"]
[]
[null,null,{"$f":"IF(D254=\"\",\"\",D255*D256+E255*E256+F255*F256+G255*G256+H255*H256+I255*I256)","v":""}]
[null,"Preis/Einheit",null,{"$f":"IF(D254=\"\",0,(VLOOKUP(D254,$B$5:$C$104,2,FALSE)))","v":0},0,0,0,0,0]
[null,"Aufwandmenge"]
[]
[null,null,{"$f":"IF(D258=\"\",\"\",D259*D260+E259*E260+F259*F260+G259*G260+H259*H260+I259*I260)","v":""}]
[null,"Preis/Einheit",null,{"$f":"IF(D258=\"\",0,(VLOOKUP(D258,$B$5:$C$104,2,FALSE)))","v":0},0,0,0,0,0]
[null,"Aufwandmenge"]
[]
[null,null,{"$f":"IF(D262=\"\",\"\",D263*D264+E263*E264+F263*F264+G263*G264+H263*H264+I263*I264)","v":""}]
[null,"Preis/Einheit",null,{"$f":"IF(D262=\"\",0,(VLOOKUP(D262,$B$5:$C$104,2,FALSE)))","v":0},0,0,0,0,0]
[null,"Aufwandmenge"]
[]
[null,null,{"$f":"IF(D266=\"\",\"\",D267*D268+E267*E268+F267*F268+G267*G268+H267*H268+I267*I268)","v":""}]
[null,"Preis/Einheit",null,{"$f":"IF(D266=\"\",0,(VLOOKUP(D266,$B$5:$C$104,2,FALSE)))","v":0},0,0,0,0,0]
[null,"Aufwandmenge"]
[]
[null,null,{"$f":"IF(D270=\"\",\"\",D271*D272+E271*E272+F271*F272+G271*G272+H271*H272+I271*I272)","v":""}]
[null,"Preis/Einheit",null,{"$f":"IF(D270=\"\",0,(VLOOKUP(D270,$B$5:$C$104,2,FALSE)))","v":0},0,0,0,0,0]
[null,"Aufwandmenge"]
[]
[null,null,{"$f":"IF(D274=\"\",\"\",D275*D276+E275*E276+F275*F276+G275*G276+H275*H276+I275*I276)","v":""}]
[null,"Preis/Einheit",null,{"$f":"IF(D274=\"\",0,(VLOOKUP(D274,$B$5:$C$104,2,FALSE)))","v":0},0,0,0,0,0]
[null,"Aufwandmenge"]
[]
[null,null,{"$f":"IF(D278=\"\",\"\",D279*D280+E279*E280+F279*F280+G279*G280+H279*H280+I279*I280)","v":""}]
[null,"Preis/Einheit",null,{"$f":"IF(D278=\"\",0,(VLOOKUP(D278,$B$5:$C$104,2,FALSE)))","v":0},0,0,0,0,0]
[null,"Aufwandmenge"]
[]
[null,null,{"$f":"IF(D282=\"\",\"\",D283*D284+E283*E284+F283*F284+G283*G284+H283*H284+I283*I284)","v":""}]
[null,"Preis/Einheit",null,{"$f":"IF(D282=\"\",0,(VLOOKUP(D282,$B$5:$C$104,2,FALSE)))","v":0},0,0,0,0,0]
[null,"Aufwandmenge"]
[]
[null,null,{"$f":"IF(D286=\"\",\"\",D287*D288+E287*E288+F287*F288+G287*G288+H287*H288+I287*I288)","v":""}]
[null,"Preis/Einheit",null,{"$f":"IF(D286=\"\",0,(VLOOKUP(D286,$B$5:$C$104,2,FALSE)))","v":0},0,0,0,0,0]
[null,"Aufwandmenge"]
[]
[null,null,{"$f":"IF(D290=\"\",\"\",D291*D292+E291*E292+F291*F292+G291*G292+H291*H292+I291*I292)","v":""}]
[null,"Preis/Einheit",null,{"$f":"IF(D290=\"\",0,(VLOOKUP(D290,$B$5:$C$104,2,FALSE)))","v":0},0,0,0,0,0]
[null,"Aufwandmenge"]
[]
[null,null,{"$f":"IF(D294=\"\",\"\",D295*D296+E295*E296+F295*F296+G295*G296+H295*H296+I295*I296)","v":""}]
[null,"Preis/Einheit",null,{"$f":"IF(D294=\"\",0,(VLOOKUP(D294,$B$5:$C$104,2,FALSE)))","v":0},0,0,0,0,0]
[null,"Aufwandmenge"]
[]
[null,null,{"$f":"IF(D298=\"\",\"\",D299*D300+E299*E300+F299*F300+G299*G300+H299*H300+I299*I300)","v":""}]
[null,"Preis/Einheit",null,{"$f":"IF(D298=\"\",0,(VLOOKUP(D298,$B$5:$C$104,2,FALSE)))","v":0},0,0,0,0,0]
[null,"Aufwandmenge"]
[]
[null,null,{"$f":"IF(D302=\"\",\"\",D303*D304+E303*E304+F303*F304+G303*G304+H303*H304+I303*I304)","v":""}]
[null,"Preis/Einheit",null,{"$f":"IF(D302=\"\",0,(VLOOKUP(D302,$B$5:$C$104,2,FALSE)))","v":0},0,0,0,0,0]
[null,"Aufwandmenge"]
[]
[null,null,{"$f":"IF(D306=\"\",\"\",D307*D308+E307*E308+F307*F308+G307*G308+H307*H308+I307*I308)","v":""}]
[null,"Preis/Einheit",null,{"$f":"IF(D306=\"\",0,(VLOOKUP(D306,$B$5:$C$104,2,FALSE)))","v":0},0,0,0,0,0]
[null,"Aufwandmenge"]
[]
[null,null,{"$f":"IF(D310=\"\",\"\",D311*D312+E311*E312+F311*F312+G311*G312+H311*H312+I311*I312)","v":""}]
[null,"Preis/Einheit",null,{"$f":"IF(D310=\"\",0,(VLOOKUP(D310,$B$5:$C$104,2,FALSE)))","v":0},0,0,0,0,0]
[null,"Aufwandmenge"]

{"sheet":"Bemerkungen PSM","index":18,"n_rows":69,"n_cols":21,"rows_kept":69,"cut":false,"hidden":false,"merged":[[5,2,5,3],[5,4,5,5],[5,6,5,7],[5,8,5,9],[4,2,4,3],[4,4,4,5],[4,6,4,7],[4,8,4,9],[4,10,4,11],[5,10,5,11],[5,12,5,13],[5,14,5,15],[5,16,5,17],[5,18,5,19],[5,20,5,21],[4,12,4,13],[4,14,4,15],[4,16,4,17],[4,18,4,19],[4,20,4,21],[7,2,7,3],[7,4,7,5],[7,6,7,7],[7,8,7,9],[6,2,6,3],[6,4,6,5],[6,6,6,7],[6,8,6,9],[6,10,6,11],[7,10,7,11],[7,12,7,13],[7,14,7,15],[7,16,7,17],[7,18,7,19],[7,20,7,21],[6,12,6,13],[6,14,6,15],[6,16,6,17],[6,18,6,19],[6,20,6,21],[9,2,9,3],[9,4,9,5],[9,6,9,7],[9,8,9,9],[8,2,8,3],[8,4,8,5],[8,6,8,7],[8,8,8,9],[8,10,8,11],[9,10,9,11],[9,12,9,13],[9,14,9,15],[9,16,9,17],[9,18,9,19],[9,20,9,21],[8,12,8,13],[8,14,8,15],[8,16,8,17],[8,18,8,19],[8,20,8,21],[11,2,11,3],[11,4,11,5],[11,6,11,7],[11,8,11,9],[10,2,10,3],[10,4,10,5],[10,6,10,7],[10,8,10,9],[10,10,10,11],[11,10,11,11],[11,12,11,13],[11,14,11,15],[11,16,11,17],[11,18,11,19],[11,20,11,21],[10,12,10,13],[10,14,10,15],[10,16,10,17],[10,18,10,19],[10,20,10,21],[13,2,13,3],[13,4,13,5],[13,6,13,7],[13,8,13,9],[12,2,12,3],[12,4,12,5],[12,6,12,7],[12,8,12,9],[12,10,12,11],[13,10,13,11],[13,12,13,13],[13,14,13,15],[13,16,13,17],[13,18,13,19],[13,20,13,21],[12,12,12,13],[12,14,12,15],[12,16,12,17],[12,18,12,19],[12,20,12,21],[15,2,15,3],[15,4,15,5],[15,6,15,7],[15,8,15,9],[14,2,14,3],[14,4,14,5],[14,6,14,7],[14,8,14,9],[14,10,14,11],[15,10,15,11],[15,12,15,13],[15,14,15,15],[15,16,15,17],[15,18,15,19],[15,20,15,21],[14,12,14,13],[14,14,14,15],[14,16,14,17],[14,18,14,19],[14,20,14,21],[17,2,17,3],[17,4,17,5],[17,6,17,7],[17,8,17,9],[16,2,16,3],[16,4,16,5],[16,6,16,7],[16,8,16,9],[16,10,16,11],[17,10,17,11],[17,12,17,13],[17,14,17,15],[17,16,17,17],[17,18,17,19],[17,20,17,21],[16,12,16,13],[16,14,16,15],[16,16,16,17],[16,18,16,19],[16,20,16,21],[19,2,19,3],[19,4,19,5],[19,6,19,7],[19,8,19,9],[18,2,18,3],[18,4,18,5],[18,6,18,7],[18,8,18,9],[18,10,18,11],[19,10,19,11],[19,12,19,13],[19,14,19,15],[19,16,19,17],[19,18,19,19],[19,20,19,21],[18,12,18,13],[18,14,18,15],[18,16,18,17],[18,18,18,19],[18,20,18,21],[21,2,21,3],[21,4,21,5],[21,6,21,7],[21,8,21,9],[20,2,20,3],[20,4,20,5],[20,6,20,7],[20,8,20,9],[20,10,20,11],[21,10,21,11],[21,12,21,13],[21,14,21,15],[21,16,21,17],[21,18,21,19],[21,20,21,21],[20,12,20,13],[20,14,20,15],[20,16,20,17],[20,18,20,19],[20,20,20,21],[23,2,23,3],[23,4,23,5],[23,6,23,7],[23,8,23,9],[22,2,22,3],[22,4,22,5],[22,6,22,7],[22,8,22,9],[22,10,22,11],[23,10,23,11],[23,12,23,13],[23,14,23,15],[23,16,23,17],[23,18,23,19],[23,20,23,21],[22,12,22,13],[22,14,22,15],[22,16,22,17],[22,18,22,19],[22,20,22,21],[25,2,25,3],[25,4,25,5],[25,6,25,7],[25,8,25,9],[24,2,24,3],[24,4,24,5],[24,6,24,7],[24,8,24,9],[24,10,24,11],[25,10,25,11],[25,12,25,13],[25,14,25,15],[25,16,25,17],[25,18,25,19],[25,20,25,21],[24,12,24,13],[24,14,24,15],[24,16,24,17],[24,18,24,19],[24,20,24,21],[27,2,27,3],[27,4,27,5],[27,6,27,7],[27,8,27,9],[26,2,26,3],[26,4,26,5],[26,6,26,7],[26,8,26,9],[26,10,26,11],[27,10,27,11],[27,12,27,13],[27,14,27,15],[27,16,27,17],[27,18,27,19],[27,20,27,21],[26,12,26,13],[26,14,26,15],[26,16,26,17],[26,18,26,19],[26,20,26,21],[29,2,29,3],[29,4,29,5],[29,6,29,7],[29,8,29,9],[28,2,28,3],[28,4,28,5],[28,6,28,7],[28,8,28,9],[28,10,28,11],[29,10,29,11],[29,12,29,13],[29,14,29,15],[29,16,29,17],[29,18,29,19],[29,20,29,21],[28,12,28,13],[28,14,28,15],[28,16,28,17],[28,18,28,19],[28,20,28,21],[31,2,31,3],[31,4,31,5],[31,6,31,7],[31,8,31,9],[30,2,30,3],[30,4,30,5],[30,6,30,7],[30,8,30,9],[30,10,30,11],[31,10,31,11],[31,12,31,13],[31,14,31,15],[31,16,31,17],[31,18,31,19],[31,20,31,21],[30,12,30,13],[30,14,30,15],[30,16,30,17],[30,18,30,19],[30,20,30,21],[33,2,33,3],[33,4,33,5],[33,6,33,7],[33,8,33,9],[32,2,32,3],[32,4,32,5],[32,6,32,7],[32,8,32,9],[32,10,32,11],[33,10,33,11],[33,12,33,13],[33,14,33,15],[33,16,33,17],[33,18,33,19],[33,20,33,21],[32,12,32,13],[32,14,32,15],[32,16,32,17],[32,18,32,19],[32,20,32,21],[35,2,35,3],[35,4,35,5],[35,6,35,7],[35,8,35,9],[34,2,34,3],[34,4,34,5],[34,6,34,7],[34,8,34,9],[34,10,34,11],[35,10,35,11],[35,12,35,13],[35,14,35,15],[35,16,35,17],[35,18,35,19],[35,20,35,21],[34,12,34,13],[34,14,34,15],[34,16,34,17],[34,18,34,19],[34,20,34,21],[37,2,37,3],[37,4,37,5],[37,6,37,7],[37,8,37,9],[36,2,36,3],[36,4,36,5],[36,6,36,7],[36,8,36,9],[36,10,36,11],[37,10,37,11],[37,12,37,13],[37,14,37,15],[37,16,37,17],[37,18,37,19],[37,20,37,21],[36,12,36,13],[36,14,36,15],[36,16,36,17],[36,18,36,19],[36,20,36,21],[39,2,39,3],[39,4,39,5],[39,6,39,7],[39,8,39,9],[38,2,38,3],[38,4,38,5],[38,6,38,7],[38,8,38,9],[38,10,38,11],[39,10,39,11],[39,12,39,13],[39,14,39,15],[39,16,39,17],[39,18,39,19],[39,20,39,21],[38,12,38,13],[38,14,38,15],[38,16,38,17],[38,18,38,19],[38,20,38,21],[41,2,41,3],[41,4,41,5],[41,6,41,7],[41,8,41,9],[40,2,40,3],[40,4,40,5],[40,6,40,7],[40,8,40,9],[40,10,40,11],[41,10,41,11],[41,12,41,13],[41,14,41,15],[41,16,41,17],[41,18,41,19],[41,20,41,21],[40,12,40,13],[40,14,40,15],[40,16,40,17],[40,18,40,19],[40,20,40,21],[43,2,43,3],[43,4,43,5],[43,6,43,7],[43,8,43,9],[42,2,42,3],[42,4,42,5],[42,6,42,7],[42,8,42,9],[42,10,42,11],[43,10,43,11],[43,12,43,13],[43,14,43,15],[43,16,43,17],[43,18,43,19],[43,20,43,21],[42,12,42,13],[42,14,42,15],[42,16,42,17],[42,18,42,19],[42,20,42,21],[45,2,45,3],[45,4,45,5],[45,6,45,7],[45,8,45,9],[44,2,44,3],[44,4,44,5],[44,6,44,7],[44,8,44,9],[44,10,44,11],[45,10,45,11],[45,12,45,13],[45,14,45,15],[45,16,45,17],[45,18,45,19],[45,20,45,21],[44,12,44,13],[44,14,44,15],[44,16,44,17],[44,18,44,19],[44,20,44,21],[47,2,47,3],[47,4,47,5],[47,6,47,7],[47,8,47,9],[46,2,46,3],[46,4,46,5],[46,6,46,7],[46,8,46,9],[46,10,46,11],[47,10,47,11],[47,12,47,13],[47,14,47,15],[47,16,47,17],[47,18,47,19],[47,20,47,21],[46,12,46,13],[46,14,46,15],[46,16,46,17],[46,18,46,19],[46,20,46,21],[49,2,49,3],[49,4,49,5],[49,6,49,7],[49,8,49,9],[48,2,48,3],[48,4,48,5],[48,6,48,7],[48,8,48,9],[48,10,48,11],[49,10,49,11],[49,12,49,13],[49,14,49,15],[49,16,49,17],[49,18,49,19],[49,20,49,21],[48,12,48,13],[48,14,48,15],[48,16,48,17],[48,18,48,19],[48,20,48,21],[51,2,51,3],[51,4,51,5],[51,6,51,7],[51,8,51,9],[50,2,50,3],[50,4,50,5],[50,6,50,7],[50,8,50,9],[50,10,50,11],[51,10,51,11],[51,12,51,13],[51,14,51,15],[51,16,51,17],[51,18,51,19],[51,20,51,21],[50,12,50,13],[50,14,50,15],[50,16,50,17],[50,18,50,19],[50,20,50,21],[53,2,53,3],[53,4,53,5],[53,6,53,7],[53,8,53,9],[52,2,52,3],[52,4,52,5],[52,6,52,7],[52,8,52,9],[52,10,52,11],[53,10,53,11],[53,12,53,13],[53,14,53,15],[53,16,53,17],[53,18,53,19],[53,20,53,21],[52,12,52,13],[52,14,52,15],[52,16,52,17],[52,18,52,19],[52,20,52,21],[55,2,55,3],[55,4,55,5],[55,6,55,7],[55,8,55,9],[54,2,54,3],[54,4,54,5],[54,6,54,7],[54,8,54,9],[54,10,54,11],[55,10,55,11],[55,12,55,13],[55,14,55,15],[55,16,55,17],[55,18,55,19],[55,20,55,21],[54,12,54,13],[54,14,54,15],[54,16,54,17],[54,18,54,19],[54,20,54,21],[57,2,57,3],[57,4,57,5],[57,6,57,7],[57,8,57,9],[56,2,56,3],[56,4,56,5],[56,6,56,7],[56,8,56,9],[56,10,56,11],[57,10,57,11],[57,12,57,13],[57,14,57,15],[57,16,57,17],[57,18,57,19],[57,20,57,21],[56,12,56,13],[56,14,56,15],[56,16,56,17],[56,18,56,19],[56,20,56,21],[59,2,59,3],[59,4,59,5],[59,6,59,7],[59,8,59,9],[58,2,58,3],[58,4,58,5],[58,6,58,7],[58,8,58,9],[58,10,58,11],[59,10,59,11],[59,12,59,13],[59,14,59,15],[59,16,59,17],[59,18,59,19],[59,20,59,21],[58,12,58,13],[58,14,58,15],[58,16,58,17],[58,18,58,19],[58,20,58,21],[65,2,65,3],[65,4,65,5],[65,6,65,7],[65,8,65,9],[65,10,65,11],[60,2,60,3],[60,4,60,5],[60,6,60,7],[60,8,60,9],[60,10,60,11],[65,14,65,15],[65,16,65,17],[65,18,65,19],[65,20,65,21],[60,12,60,13],[60,14,60,15],[60,16,60,17],[60,18,60,19],[60,20,60,21],[65,12,65,13]]}
[]
[]
[]
[]
[null,"Bemerkung","Anwender",null,"Indikation",null,"EC Stadium",null,"Technik",null,"Wetter"]
[null,{"$f":"C6 &\" \"& E6 &\" \"& G6 &\" \"& I6 &\" \"& K6 &\" \"& M6 &\" \"& O6 &\" \" &Q6 &\" \"& S6 &\" \"& U6","v":"Ralf, Thripse, EC 49, 04 er sonnig 10°C      "},"Ralf,",null,"Thripse,",null,"EC 49,",null,"04 er",null,"sonnig 10°C "]
[null,{"$f":"C7 &\" \"& E7 &\" \"& G7 &\" \"& I7 &\" \"& K7 &\" \"& M7 &\" \"& O7 &\" \" &Q7 &\" \"& S7 &\" \"& U7","v":"Ralf,  Unkraut        "},"Ralf, ",null,"Unkraut"]
[null,"Ralf, Pilzinfektion 42 04 er bewölkt 21°C     ","Ralf,",null,"Pilzinfektion",null,42,null,"04 er",null,"bewölkt 21°C"]
[null,"Ralf, Stemphylium 55 04 er bewölkt 21°C     ","Ralf,",null,"Stemphylium",null,55,null,"04 er",null,"bewölkt 21°C"]
[null,"Ralf, Spargelhähnchen, 60 04 er bewölkt 24°C     ","Ralf,",null,"Spargelhähnchen,",null,60,null,"04 er",null,"bewölkt 24°C"]
[null,"         "]
[null,"         "]
[null,"         "]
[null,"         "]
[null,"         "]
[null,"         "]
[null,"         "]
[null,"         "]
[null,"         "]
[null,"         "]
[null,"         "]
[null,"         "]
[null,"         "]
[null,"         "]
[null,"         "]
[null,"         "]
[null,"         "]
[null,"         "]
[null,"         "]
[null,"         "]
[null,"         "]
[null,"         "]
[null,"         "]
[null,"         "]
[null,"         "]
[null,"         "]
[null,"         "]
[null,"         "]
[null,"         "]
[null,"         "]
[null,"         "]
[null,"         "]
[null,"         "]
[null,"         "]
[null,"         "]
[null,"         "]
[null,"         "]
[null,"         "]
[null,"         "]
[null,"         "]
[null,"         "]
[null,"         "]
[null,"         "]
[null,"         "]
[null,"         "]
[null,"         "]
[null,"         "]
[null,"         "]
[null,"         "]
[null,"         "]
[null,"         "]
[]
[]
[null,null,null,null,null,null,null,null,"Hilfe!"]
[null,null,"Kürzel"]
[null,null,{"$f":"IF(C5=\"\",\"\",C5)","v":"Anwender"},null,{"$f":"IF(E5=\"\",\"\",E5)","v":"Indikation"},null,{"$f":"IF(G5=\"\",\"\",G5)","v":"EC Stadium"},null,{"$f":"IF(I5=\"\",\"\",I5)","v":"Technik"},null,{"$f":"IF(K5=\"\",\"\",K5)","v":"Wetter"},null,{"$f":"IF(M5=\"\",\"\",M5)","v":""},null,{"$f":"IF(O5=\"\",\"\",O5)","v":""},null,{"$f":"IF(Q5=\"\",\"\",Q5)","v":""},null,{"$f":"IF(S5=\"\",\"\",S5)","v":""},null,{"$f":"IF(U5=\"\",\"\",U5)","v":""}]
[null,null,"Ralf",1,"Mehltau",11,49,49]
[null,null,"Peter",2]
[null,null,"Karl",3]

{"sheet":"Bemerkungen Dünger","index":19,"n_rows":71,"n_cols":21,"rows_kept":71,"cut":false,"hidden":false,"merged":[[65,20,65,21],[60,14,60,15],[60,16,60,17],[60,18,60,19],[60,20,60,21],[65,2,65,3],[65,4,65,5],[65,6,65,7],[65,8,65,9],[65,10,65,11],[65,12,65,13],[60,2,60,3],[60,4,60,5],[60,6,60,7],[60,8,60,9],[60,10,60,11],[60,12,60,13],[65,14,65,15],[65,16,65,17],[65,18,65,19],[58,20,58,21],[59,2,59,3],[59,4,59,5],[59,6,59,7],[59,8,59,9],[59,10,59,11],[59,12,59,13],[59,14,59,15],[59,16,59,17],[59,18,59,19],[59,20,59,21],[58,2,58,3],[58,4,58,5],[58,6,58,7],[58,8,58,9],[58,10,58,11],[58,12,58,13],[58,14,58,15],[58,16,58,17],[58,18,58,19],[56,20,56,21],[57,2,57,3],[57,4,57,5],[57,6,57,7],[57,8,57,9],[57,10,57,11],[57,12,57,13],[57,14,57,15],[57,16,57,17],[57,18,57,19],[57,20,57,21],[56,2,56,3],[56,4,56,5],[56,6,56,7],[56,8,56,9],[56,10,56,11],[56,12,56,13],[56,14,56,15],[56,16,56,17],[56,18,56,19],[54,20,54,21],[55,2,55,3],[55,4,55,5],[55,6,55,7],[55,8,55,9],[55,10,55,11],[55,12,55,13],[55,14,55,15],[55,16,55,17],[55,18,55,19],[55,20,55,21],[54,2,54,3],[54,4,54,5],[54,6,54,7],[54,8,54,9],[54,10,54,11],[54,12,54,13],[54,14,54,15],[54,16,54,17],[54,18,54,19],[52,20,52,21],[53,2,53,3],[53,4,53,5],[53,6,53,7],[53,8,53,9],[53,10,53,11],[53,12,53,13],[53,14,53,15],[53,16,53,17],[53,18,53,19],[53,20,53,21],[52,2,52,3],[52,4,52,5],[52,6,52,7],[52,8,52,9],[52,10,52,11],[52,12,52,13],[52,14,52,15],[52,16,52,17],[52,18,52,19],[50,20,50,21],[51,2,51,3],[51,4,51,5],[51,6,51,7],[51,8,51,9],[51,10,51,11],[51,12,51,13],[51,14,51,15],[51,16,51,17],[51,18,51,19],[51,20,51,21],[50,2,50,3],[50,4,50,5],[50,6,50,7],[50,8,50,9],[50,10,50,11],[50,12,50,13],[50,14,50,15],[50,16,50,17],[50,18,50,19],[48,20,48,21],[49,2,49,3],[49,4,49,5],[49,6,49,7],[49,8,49,9],[49,10,49,11],[49,12,49,13],[49,14,49,15],[49,16,49,17],[49,18,49,19],[49,20,49,21],[48,2,48,3],[48,4,48,5],[48,6,48,7],[48,8,48,9],[48,10,48,11],[48,12,48,13],[48,14,48,15],[48,16,48,17],[48,18,48,19],[46,20,46,21],[47,2,47,3],[47,4,47,5],[47,6,47,7],[47,8,47,9],[47,10,47,11],[47,12,47,13],[47,14,47,15],[47,16,47,17],[47,18,47,19],[47,20,47,21],[46,2,46,3],[46,4,46,5],[46,6,46,7],[46,8,46,9],[46,10,46,11],[46,12,46,13],[46,14,46,15],[46,16,46,17],[46,18,46,19],[44,20,44,21],[45,2,45,3],[45,4,45,5],[45,6,45,7],[45,8,45,9],[45,10,45,11],[45,12,45,13],[45,14,45,15],[45,16,45,17],[45,18,45,19],[45,20,45,21],[44,2,44,3],[44,4,44,5],[44,6,44,7],[44,8,44,9],[44,10,44,11],[44,12,44,13],[44,14,44,15],[44,16,44,17],[44,18,44,19],[42,20,42,21],[43,2,43,3],[43,4,43,5],[43,6,43,7],[43,8,43,9],[43,10,43,11],[43,12,43,13],[43,14,43,15],[43,16,43,17],[43,18,43,19],[43,20,43,21],[42,2,42,3],[42,4,42,5],[42,6,42,7],[42,8,42,9],[42,10,42,11],[42,12,42,13],[42,14,42,15],[42,16,42,17],[42,18,42,19],[40,20,40,21],[41,2,41,3],[41,4,41,5],[41,6,41,7],[41,8,41,9],[41,10,41,11],[41,12,41,13],[41,14,41,15],[41,16,41,17],[41,18,41,19],[41,20,41,21],[40,2,40,3],[40,4,40,5],[40,6,40,7],[40,8,40,9],[40,10,40,11],[40,12,40,13],[40,14,40,15],[40,16,40,17],[40,18,40,19],[38,20,38,21],[39,2,39,3],[39,4,39,5],[39,6,39,7],[39,8,39,9],[39,10,39,11],[39,12,39,13],[39,14,39,15],[39,16,39,17],[39,18,39,19],[39,20,39,21],[38,2,38,3],[38,4,38,5],[38,6,38,7],[38,8,38,9],[38,10,38,11],[38,12,38,13],[38,14,38,15],[38,16,38,17],[38,18,38,19],[36,20,36,21],[37,2,37,3],[37,4,37,5],[37,6,37,7],[37,8,37,9],[37,10,37,11],[37,12,37,13],[37,14,37,15],[37,16,37,17],[37,18,37,19],[37,20,37,21],[36,2,36,3],[36,4,36,5],[36,6,36,7],[36,8,36,9],[36,10,36,11],[36,12,36,13],[36,14,36,15],[36,16,36,17],[36,18,36,19],[34,20,34,21],[35,2,35,3],[35,4,35,5],[35,6,35,7],[35,8,35,9],[35,10,35,11],[35,12,35,13],[35,14,35,15],[35,16,35,17],[35,18,35,19],[35,20,35,21],[34,2,34,3],[34,4,34,5],[34,6,34,7],[34,8,34,9],[34,10,34,11],[34,12,34,13],[34,14,34,15],[34,16,34,17],[34,18,34,19],[32,20,32,21],[33,2,33,3],[33,4,33,5],[33,6,33,7],[33,8,33,9],[33,10,33,11],[33,12,33,13],[33,14,33,15],[33,16,33,17],[33,18,33,19],[33,20,33,21],[32,2,32,3],[32,4,32,5],[32,6,32,7],[32,8,32,9],[32,10,32,11],[32,12,32,13],[32,14,32,15],[32,16,32,17],[32,18,32,19],[30,20,30,21],[31,2,31,3],[31,4,31,5],[31,6,31,7],[31,8,31,9],[31,10,31,11],[31,12,31,13],[31,14,31,15],[31,16,31,17],[31,18,31,19],[31,20,31,21],[30,2,30,3],[30,4,30,5],[30,6,30,7],[30,8,30,9],[30,10,30,11],[30,12,30,13],[30,14,30,15],[30,16,30,17],[30,18,30,19],[28,20,28,21],[29,2,29,3],[29,4,29,5],[29,6,29,7],[29,8,29,9],[29,10,29,11],[29,12,29,13],[29,14,29,15],[29,16,29,17],[29,18,29,19],[29,20,29,21],[28,2,28,3],[28,4,28,5],[28,6,28,7],[28,8,28,9],[28,10,28,11],[28,12,28,13],[28,14,28,15],[28,16,28,17],[28,18,28,19],[26,20,26,21],[27,2,27,3],[27,4,27,5],[27,6,27,7],[27,8,27,9],[27,10,27,11],[27,12,27,13],[27,14,27,15],[27,16,27,17],[27,18,27,19],[27,20,27,21],[26,2,26,3],[26,4,26,5],[26,6,26,7],[26,8,26,9],[26,10,26,11],[26,12,26,13],[26,14,26,15],[26,16,26,17],[26,18,26,19],[24,20,24,21],[25,2,25,3],[25,4,25,5],[25,6,25,7],[25,8,25,9],[25,10,25,11],[25,12,25,13],[25,14,25,15],[25,16,25,17],[25,18,25,19],[25,20,25,21],[24,2,24,3],[24,4,24,5],[24,6,24,7],[24,8,24,9],[24,10,24,11],[24,12,24,13],[24,14,24,15],[24,16,24,17],[24,18,24,19],[22,20,22,21],[23,2,23,3],[23,4,23,5],[23,6,23,7],[23,8,23,9],[23,10,23,11],[23,12,23,13],[23,14,23,15],[23,16,23,17],[23,18,23,19],[23,20,23,21],[22,2,22,3],[22,4,22,5],[22,6,22,7],[22,8,22,9],[22,10,22,11],[22,12,22,13],[22,14,22,15],[22,16,22,17],[22,18,22,19],[20,20,20,21],[21,2,21,3],[21,4,21,5],[21,6,21,7],[21,8,21,9],[21,10,21,11],[21,12,21,13],[21,14,21,15],[21,16,21,17],[21,18,21,19],[21,20,21,21],[20,2,20,3],[20,4,20,5],[20,6,20,7],[20,8,20,9],[20,10,20,11],[20,12,20,13],[20,14,20,15],[20,16,20,17],[20,18,20,19],[18,20,18,21],[19,2,19,3],[19,4,19,5],[19,6,19,7],[19,8,19,9],[19,10,19,11],[19,12,19,13],[19,14,19,15],[19,16,19,17],[19,18,19,19],[19,20,19,21],[18,2,18,3],[18,4,18,5],[18,6,18,7],[18,8,18,9],[18,10,18,11],[18,12,18,13],[18,14,18,15],[18,16,18,17],[18,18,18,19],[16,20,16,21],[17,2,17,3],[17,4,17,5],[17,6,17,7],[17,8,17,9],[17,10,17,11],[17,12,17,13],[17,14,17,15],[17,16,17,17],[17,18,17,19],[17,20,17,21],[16,2,16,3],[16,4,16,5],[16,6,16,7],[16,8,16,9],[16,10,16,11],[16,12,16,13],[16,14,16,15],[16,16,16,17],[16,18,16,19],[14,20,14,21],[15,2,15,3],[15,4,15,5],[15,6,15,7],[15,8,15,9],[15,10,15,11],[15,12,15,13],[15,14,15,15],[15,16,15,17],[15,18,15,19],[15,20,15,21],[14,2,14,3],[14,4,14,5],[14,6,14,7],[14,8,14,9],[14,10,14,11],[14,12,14,13],[14,14,14,15],[14,16,14,17],[14,18,14,19],[12,20,12,21],[13,2,13,3],[13,4,13,5],[13,6,13,7],[13,8,13,9],[13,10,13,11],[13,12,13,13],[13,14,13,15],[13,16,13,17],[13,18,13,19],[13,20,13,21],[12,2,12,3],[12,4,12,5],[12,6,12,7],[12,8,12,9],[12,10,12,11],[12,12,12,13],[12,14,12,15],[12,16,12,17],[12,18,12,19],[10,20,10,21],[11,2,11,3],[11,4,11,5],[11,6,11,7],[11,8,11,9],[11,10,11,11],[11,12,11,13],[11,14,11,15],[11,16,11,17],[11,18,11,19],[11,20,11,21],[10,2,10,3],[10,4,10,5],[10,6,10,7],[10,8,10,9],[10,10,10,11],[10,12,10,13],[10,14,10,15],[10,16,10,17],[10,18,10,19],[8,20,8,21],[9,2,9,3],[9,4,9,5],[9,6,9,7],[9,8,9,9],[9,10,9,11],[9,12,9,13],[9,14,9,15],[9,16,9,17],[9,18,9,19],[9,20,9,21],[8,2,8,3],[8,4,8,5],[8,6,8,7],[8,8,8,9],[8,10,8,11],[8,12,8,13],[8,14,8,15],[8,16,8,17],[8,18,8,19],[6,20,6,21],[7,2,7,3],[7,4,7,5],[7,6,7,7],[7,8,7,9],[7,10,7,11],[7,12,7,13],[7,14,7,15],[7,16,7,17],[7,18,7,19],[7,20,7,21],[6,2,6,3],[6,4,6,5],[6,6,6,7],[6,8,6,9],[6,10,6,11],[6,12,6,13],[6,14,6,15],[6,16,6,17],[6,18,6,19],[4,14,4,15],[4,16,4,17],[4,18,4,19],[4,20,4,21],[5,2,5,3],[5,4,5,5],[5,6,5,7],[5,8,5,9],[5,10,5,11],[5,12,5,13],[4,2,4,3],[4,4,4,5],[4,6,4,7],[4,8,4,9],[4,10,4,11],[4,12,4,13],[5,14,5,15],[5,16,5,17],[5,18,5,19],[5,20,5,21]]}
[]
[]
[]
[]
[null,"Bemerkung","Anwender",null,"Indikation",null,"EC Stadium",null,"Technik",null,"Wetter"]
[null,{"$f":"C6 &\" \"& E6 &\" \"& G6 &\" \"& I6 &\" \"& K6 &\" \"& M6 &\" \"& O6 &\" \" &Q6 &\" \"& S6 &\" \"& U6","v":"Ralf, NP Max Bedarf        "},"Ralf,",null,"NP Max Bedarf"]
[null,{"$f":"C7 &\" \"& E7 &\" \"& G7 &\" \"& I7 &\" \"& K7 &\" \"& M7 &\" \"& O7 &\" \" &Q7 &\" \"& S7 &\" \"& U7","v":"         "}]
[null,"         "]
[null,"         "]
[null,"         "]
[null,"         "]
[null,"         "]
[null,"         "]
[null,"         "]
[null,"         "]
[null,"         "]
[null,"         "]
[null,"         "]
[null,"         "]
[null,"         "]
[null,"         "]
[null,"         "]
[null,"         "]
[null,"         "]
[null,"         "]
[null,"         "]
[null,"         "]
[null,"         "]
[null,"         "]
[null,"         "]
[null,"         "]
[null,"         "]
[null,"         "]
[null,"         "]
[null,"         "]
[null,"         "]
[null,"         "]
[null,"         "]
[null,"         "]
[null,"         "]
[null,"         "]
[null,"         "]
[null,"         "]
[null,"         "]
[null,"         "]
[null,"         "]
[null,"         "]
[null,"         "]
[null,"         "]
[null,"         "]
[null,"         "]
[null,"         "]
[null,"         "]
[null,"         "]
[null,"         "]
[null,"         "]
[null,"         "]
[null,"         "]
[null,"         "]
[null,"         "]
[null,"         "]
[]
[]
[null,null,null,null,null,null,"Hilfe!"]
[null,null,"Kürzel"]
[null,null,{"$f":"IF(C5=\"\",\"\",C5)","v":"Anwender"},null,{"$f":"IF(E5=\"\",\"\",E5)","v":"Indikation"},null,{"$f":"IF(G5=\"\",\"\",G5)","v":"EC Stadium"},null,{"$f":"IF(I5=\"\",\"\",I5)","v":"Technik"},null,{"$f":"IF(K5=\"\",\"\",K5)","v":"Wetter"},null,{"$f":"IF(M5=\"\",\"\",M5)","v":""},null,{"$f":"IF(O5=\"\",\"\",O5)","v":""},null,{"$f":"IF(Q5=\"\",\"\",Q5)","v":""},null,{"$f":"IF(S5=\"\",\"\",S5)","v":""},null,{"$f":"IF(U5=\"\",\"\",U5)","v":""}]
[null,null,"Ralf",1,null,null,null,null,"01 er",1,"sonnig",1]
[null,null,"Peter",2,null,null,null,null,"02 er",2,"wolkig",2]
[null,null,"Karl",3,null,null,null,null,"3 er",3,"Regen",3]
[null,null,null,null,null,null,null,null,"4 er",4]
[null,null,null,null,null,null,null,null,"5 er",5]